program: Gaussian 09
title: 000217198
version: EM64L-G09RevD.01
frameworkgroup: C1[X(C10H5NOS)]
method: RPBEPBE
basis: SDD
operation: Freq
keyword: #p
keyword: freq=noraman
keyword: PBEPBE/SDD
title: #p freq=noraman PBEPBE/SDD
converged: NO YES NO YES
title: Mulliken charges:
elementType: S O N C C C C C C C C C C H H H H H
charge: 0.048217 -0.246511 0.020107 0.410490 0.155428 -0.412016 -0.354569 -0.340582 -0.237058 -0.260692 -0.205723 0.302195 -0.206751 0.279618 0.271900 0.288725 0.242246 0.244977
chargesum: 0.00000
title: Mulliken charges with hydrogens summed into heavy atoms:
elementType: S O N C C C C C C C C C C
charge: 0.048217 -0.246511 0.020107 0.410490 0.155428 -0.412016 -0.074951 -0.068681 0.005187 0.028033 0.039254 0.302195 -0.206751
polarizability: 1.94622001e+02 -9.35944424e+00 1.85183139e+02 -1.64693172e-03 -4.01960047e-05 4.93749105e+01
1716.lowfreq: -7.4707 -3.7691 -0.0008 0.0004 0.0013 6.4272 75.2831 105.8630 126.7676
frequency: 75.2646 105.8617 126.7657 160.0629 219.1483 246.3573 374.0898 374.9153 388.5628 425.9849 439.8837 496.2347 509.3380 580.4852 610.5326 620.0206 646.7791 717.9739 748.2787 781.5848 809.2164 884.6234 900.7624 903.2576 975.3831 980.2435 1004.2782 1026.3508 1096.8047 1142.1271 1165.9049 1190.7250 1209.8887 1274.8284 1306.8081 1332.8154 1395.0320 1447.0931 1461.0262 1550.5960 1583.2298 1616.7186 2186.1156 3141.6389 3152.2799 3167.1314 3180.4389 3184.2766
redmass: 6.1081 7.8803 11.4840 4.6022 9.2948 6.5490 6.8441 10.4553 7.9243 11.5367 3.9770 7.6274 3.6668 7.2665 6.1284 8.2957 4.4324 5.9629 3.6065 1.3439 7.3669 1.4335 8.4986 1.3897 1.3620 7.4307 1.3369 2.0453 2.4186 1.7283 1.4407 2.2517 2.8653 1.8841 2.0876 3.7527 8.5741 2.7628 2.7374 6.9504 7.2517 7.0618 12.6203 1.0875 1.0903 1.0949 1.1000 1.0934
irintensity: 0.1330 2.0390 3.4793 5.2368 1.5433 1.3232 4.5351 4.8047 0.7212 1.0253 2.2398 2.0230 1.2897 2.6128 0.0056 4.8211 0.0455 1.2677 5.3649 96.1693 26.2892 0.0197 33.2410 21.1615 3.7182 3.1342 0.2059 6.6381 5.8308 15.3960 3.6224 37.9911 49.8812 23.5147 17.0176 128.8859 1.4411 43.5682 4.9953 27.3817 61.0149 54.7078 7.6922 2.2986 1.3133 11.9412 11.6957 3.6136
temp: 298.150 k
press: 1.00000 atm
elementType: 16 8 7 6 6 6 6 6 6 6 6 6 6 1 1 1 1 1
symmnumber: 1
zpe: 316518.2 jmol-1
zpe.correction: 0.120555 hartree
zpe.thermalcorrener: 0.130668 hartree
zpe.thermalcorrenthalpy: 0.131612 hartree
zpe.thermalcorrgfe: 0.084149 hartree
zpe.sumelectzpe: -911.195021 hartree
zpe.sumelectthermal: -911.184909 hartree
zpe.sumelectthermalent: -911.183965 hartree
zpe.sumelectthermalfe: -911.231428 hartree
dipole: -3.9725 -2.4056 0.0003
dipole: 4.6441
quadrupole: -86.0044 -84.4336 -83.4435
quadrupole: 11.0048 0.0018 -0.0002
quadrupole: -1.3772 0.1935 1.1836 11.0048 0.0018 -0.0002
hfenergy: -911.3155767 hartree
pointgroup: C01 [X(C10H5N1O1S1)]
dipole: -1.6049221 -0.8732646 0.0001136 debye
dipolederiv: -0.3014311 0.1467129 0.000065 -0.0327003 -0.7367984 -0.0001593 0.0000088 -0.0001663 -0.1716082 -0.9367794 -0.2831035 0.0000335 -0.0333626 -0.7549702 -0.0001838 0.0000794 -0.0001363 -0.1368468 -0.2424376 0.1162053 -0.0000932 0.0080286 -0.2179746 0.000039 -0.0000559 -0.0000164 -0.2049875 -0.2066129 -0.2725994 -0.0000406 -0.2459962 -0.5547364 -0.0001442 -0.0000397 -0.0001475 0.0623092 0.7142983 -0.0415539 -0.0001014 0.1511755 0.2892076 0.0000354 -0.0000548 0.0000674 0.1118454 0.5486506 -0.1404526 -0.0001467 0.165684 1.0612633 0.0003019 -0.0000323 0.0003463 -0.1122681 -0.0263967 0.1804057 0.0000456 -0.1221447 0.0432796 0.0000667 -0.0000476 0.0000196 -0.1060971 -0.2845396 -0.0167092 0.0000153 -0.1074281 0.1046578 0.0000929 -0.0000148 0.000088 -0.1600623 0.1602117 -0.1245862 -0.0000776 -0.1359869 -0.2960602 -0.000025 -0.0000849 -0.0000328 -0.1399942 -0.3191895 0.3642614 0.0001564 0.0556366 -0.3425402 -0.0000852 0.0000204 -0.0001091 -0.0755657 0.0538955 -0.0682603 -0.0000421 0.0939206 0.2210316 0.0000932 0.0000054 0.0001162 -0.1301173 0.6380214 0.3996959 0.0000592 0.2899157 0.9528291 0.0001802 0.0000473 0.0001421 0.2104067 0.0344895 -0.2205286 0.0000506 -0.0711965 0.0462912 -0.000027 0.0000858 0.0000075 0.0434282 0.1319843 -0.0244715 -0.0000069 0.0873048 0.0230288 -0.000052 0.0000254 -0.0000341 0.1489106 0.0808702 0.0657145 0.0000333 0.028721 0.0040919 -0.0000573 0.0000248 -0.0000641 0.1799481 0.0409489 0.0039432 0.0000186 -0.0661179 0.0846761 -0.0000088 -0.0000038 -0.0000167 0.1591446 -0.0972697 0.01591 0.0000412 0.0313978 0.0812067 -0.0000286 0.0000479 -0.0000251 0.1622374 0.0112861 -0.1005836 -0.0000102 -0.0968514 -0.0084838 -0.0000382 -0.0000114 -0.0000386 0.1593171 unknown
polarizability: 193.7384077|-9.7549153|186.0667133|-0.0285851|0.0434322|49.3749288 unknown
InChI: InChI=1S/C10H5NOS/c11-6-7-5-10(13)8-3-1-2-4-9(8)12-7/h1-5H
charge 0 multiplicity 1
18 atoms
S  -0.328511 3.304606 0.001291
O  0.854212 -1.174672 -0.000168
N  4.279524 -0.994291 -0.000985
C  -0.936293 0.546004 0.000612
C  -0.513269 -0.816006 0.000137
C  0.061158 1.634644 0.000825
C  -2.338897 0.789672 0.000872
C  -1.419434 -1.895901 -0.000071
C  -3.25716 -0.271435 0.000668
C  1.444694 1.196881 0.000458
C  -2.797583 -1.618029 0.000195
C  1.795126 -0.138859 0.000005
C  3.14515 -0.615932 -0.000319
H  -2.66698 1.834735 0.001238
H  -1.032714 -2.918767 -0.000438
H  2.23487 1.951304 0.000562
H  -4.331854 -0.064211 0.000879
H  -3.51614 -2.443944 0.000036
