program: Gaussian 09
title: 000217190
version: EM64L-G09RevD.01
frameworkgroup: C1[X(C20H30O3)]
method: RPBEPBE
basis: SDD
operation: Freq
keyword: #pfreq=noraman
keyword: PBEPBE/SDD
title: #p freq=noraman PBEPBE/SDD
converged: NO YES NO NO
title: Mulliken charges:
elementType: O O O C C C C C C C C C C C C C C C C C C C C H H H H H H H H H H H H H H H H H H H H H H H H H H H H H H
charge: -0.430296 -0.275108 -0.231752 0.452441 -0.178112 -0.228400 -0.527982 -0.194792 -0.513658 -0.421943 -0.456370 0.509578 -0.567052 -0.866512 -0.496227 -0.221972 -0.616671 0.336519 0.165276 -0.145689 -0.720107 -0.731880 -0.499764 0.258904 0.223144 0.210711 0.199849 0.252709 0.230502 0.225448 0.211193 0.200912 0.221639 0.211778 0.213093 0.234108 0.226202 0.244916 0.218340 0.220599 0.239557 0.246828 0.209863 0.324857 0.212462 0.252628 0.211134 0.219760 0.209111 0.218915 0.241667 0.230714 0.238930
chargesum: 0.00000
title: Mulliken charges with hydrogens summed into heavy atoms:
elementType: O O O C C C C C C C C C C C C C C C C C C C C
charge: -0.105440 -0.275108 -0.231752 0.452441 0.080792 -0.005257 -0.117422 0.057917 -0.057707 -0.009838 -0.022952 0.509578 -0.119851 -0.177055 -0.275628 0.017585 -0.369843 0.336519 0.165276 0.064174 -0.043883 -0.084095 0.211548
polarizability: 2.94318072e+02 1.34990043e+01 2.07893062e+02 1.40966173e+01 7.99430944e+00 1.77024292e+02
1716.lowfreq: -14.5261 -7.8273 -5.0159 -0.0007 -0.0005 -0.0002 26.4677 35.3679 38.8325
frequency: 26.4143 35.2456 38.8144 56.0493 68.4850 87.3684 92.5031 122.5847 127.6025 144.2659 170.4831 189.8407 194.1118 208.2761 231.9869 244.8173 251.8657 254.6005 270.1970 275.2878 286.3361 293.0847 318.3983 326.2674 332.8283 348.7917 368.9157 382.8153 388.6414 414.1630 420.7952 447.3523 457.8360 499.0518 508.1199 527.2359 543.5327 584.8046 629.4749 655.4467 688.7316 697.8372 710.2330 740.3021 746.5120 780.6025 799.9158 820.2904 845.3746 857.1614 872.0361 885.1720 906.3744 913.7575 921.4656 932.9111 949.6176 959.3585 961.3895 976.4853 988.6045 1005.0617 1015.4520 1027.5051 1038.5881 1059.3123 1072.8537 1078.2596 1097.3533 1104.9610 1110.5628 1113.6045 1122.0786 1130.1273 1141.6136 1145.3863 1148.9319 1163.9199 1174.6155 1195.5087 1199.4688 1204.6821 1214.4813 1226.1843 1235.4084 1257.7387 1271.9994 1282.4327 1287.3932 1294.6950 1295.7406 1302.1237 1309.2590 1314.9319 1323.5525 1330.7482 1339.4440 1341.6606 1351.5317 1353.4187 1359.1482 1362.6067 1372.7420 1379.0606 1389.9774 1395.8743 1421.2406 1450.6220 1452.3210 1457.4990 1463.6623 1463.7212 1468.0188 1468.2681 1472.4565 1474.4980 1484.0633 1489.2866 1491.1833 1495.5683 1626.7744 1632.3820 1657.0521 2913.7148 2935.2222 2951.7301 2964.7191 2966.4456 2973.2574 2977.3297 2978.9204 2979.8349 2986.3791 2988.1242 2989.9159 3000.3929 3002.4558 3014.2203 3024.6775 3033.0668 3054.0739 3062.5392 3066.5739 3071.5863 3072.7852 3075.2642 3080.4922 3088.2579 3090.6696 3103.3452 3109.4942 3146.6665 3538.2075
redmass: 4.5459 3.9197 4.0763 3.1766 3.4956 3.4141 1.1757 3.4128 3.0332 3.1808 3.4506 4.0924 2.7113 2.3317 1.2073 1.7244 2.9733 2.0852 2.1846 1.1341 2.5673 3.8290 2.3960 3.3363 2.3105 1.2741 3.1081 2.6670 2.7371 3.2970 3.1058 4.1072 2.7041 3.4520 3.3488 2.8249 2.7765 3.3581 3.4969 3.4634 3.5868 5.4610 3.3229 2.7874 2.8604 3.6885 2.6732 1.5047 2.2927 1.8131 2.1079 2.2893 1.5264 1.4249 1.5383 2.1163 2.7213 1.4097 1.9522 2.5521 3.0534 2.4896 2.4315 2.3290 2.4517 2.2152 1.7071 1.6591 2.4922 2.2194 1.2738 1.9967 2.2026 1.8904 1.9748 1.6139 1.5726 1.4951 1.8471 1.8412 1.7313 1.8001 2.0531 1.7996 1.7293 1.4133 1.2974 1.3085 1.3341 1.2348 1.4947 1.6051 1.4420 1.3561 1.3520 1.4402 1.4381 1.5176 1.3454 1.5139 1.3390 1.7576 1.4375 1.5688 1.2279 1.2096 1.1804 1.0545 1.0842 1.0880 1.0867 1.0515 1.0584 1.0791 1.0448 1.0889 1.0476 1.0549 1.0527 1.0559 7.9652 9.4383 7.1667 1.0804 1.0658 1.0640 1.0812 1.0806 1.0353 1.0359 1.0597 1.0632 1.0426 1.0593 1.0913 1.0808 1.0296 1.0847 1.0951 1.1013 1.1022 1.0982 1.0997 1.0999 1.0979 1.0992 1.0986 1.0997 1.0903 1.1044 1.0893 1.1047 1.0658
irintensity: 1.1110 0.5681 0.1120 0.6285 0.1767 0.5450 0.1826 1.4634 0.6458 0.5177 3.8127 7.3659 1.6468 0.9838 0.2037 1.6281 0.2066 0.8238 1.5956 0.0460 0.2376 6.4242 0.8169 3.0929 5.9500 101.2047 0.2682 1.3114 21.0856 1.0578 1.7065 1.9732 3.9607 5.5668 13.3513 1.9095 0.2900 2.5872 2.7848 2.7340 4.5553 5.3952 4.8450 11.2283 12.9641 11.7229 13.6378 10.7741 7.9098 0.2611 9.0664 11.9727 3.2413 1.1358 26.1512 6.3555 51.0887 1.8768 32.3715 14.7086 50.8514 3.1903 31.8515 11.9458 19.8944 8.0706 0.7661 1.5823 4.4622 11.7042 0.2496 18.7661 5.4794 49.1890 27.8189 3.0429 1.1208 5.3342 38.9148 7.8573 0.8408 97.4920 25.3862 2.5544 15.5118 0.1550 6.0633 0.7506 0.2433 6.7122 2.6905 12.1238 14.3492 1.6268 0.8348 2.4918 2.2966 0.7356 43.7154 1.5985 18.4277 4.5086 15.2525 7.0827 13.6591 27.9723 18.9436 12.2771 8.3381 5.7709 8.5580 9.1581 5.1964 12.9321 4.6925 8.5742 10.1417 6.1778 16.7442 2.7644 8.5180 196.4966 2.6615 13.9189 32.1291 23.6812 13.4916 18.5821 27.0830 43.1960 23.3227 0.8011 33.7522 40.3819 26.1957 27.8143 39.7439 19.5913 44.1811 45.8470 52.9931 34.0841 10.2464 39.8850 26.6625 88.2459 32.2289 27.3023 29.9851 27.3752 24.1816 14.7617 5.6078
temp: 298.150 k
press: 1.00000 atm
elementType: 8 8 8 6 6 6 6 6 6 6 6 6 6 6 6 6 6 6 6 6 6 6 6 1 1 1 1 1 1 1 1 1 1 1 1 1 1 1 1 1 1 1 1 1 1 1 1 1 1 1 1 1 1
symmnumber: 1
zpe: 1204817.8 jmol-1
zpe.correction: 0.458891 hartree
zpe.thermalcorrener: 0.482734 hartree
zpe.thermalcorrenthalpy: 0.483678 hartree
zpe.thermalcorrgfe: 0.406158 hartree
zpe.sumelectzpe: -1003.998910 hartree
zpe.sumelectthermal: -1003.975067 hartree
zpe.sumelectthermalent: -1003.974123 hartree
zpe.sumelectthermalfe: -1004.051643 hartree
dipole: -0.1657 -0.3873 0.7907
dipole: 0.8959
quadrupole: -149.3539 -135.9075 -139.8486
quadrupole: -5.0242 -16.5518 -6.5366
quadrupole: -7.6505 5.7958 1.8547 -5.0242 -16.5518 -6.5366
hfenergy: -1004.4578008 hartree
pointgroup: C01 [X(C20H30O3)]
dipole: -0.0644867 -0.1867388 0.291928 debye
polarizability: 293.9398891|12.6948929|205.9905451|15.8697279|11.4211623|179.3049919 unknown
InChI: InChI=1S/C20H30O3/c1-12(2)15-10-13-7-8-16-14(19(22)23-4)6-5-9-20(16,3)17(13)11-18(15)21/h7,10,12,14,16-18,21H,5-6,8-9,11H2,1-4H3
charge 0 multiplicity 1
53 atoms
O  4.289589 1.978676 0.433762
O  -4.078869 -1.445499 0.994879
O  -4.909899 -1.179992 -1.161178
C  -0.705299 1.144746 -0.201318
C  -1.712243 -0.060813 -0.154684
C  0.702124 0.569956 0.197288
C  -1.141344 2.204097 0.857421
C  -3.198157 0.39582 -0.301045
C  -1.347797 -1.142161 -1.201145
C  -2.609211 2.659841 0.705836
C  -3.571525 1.455425 0.773532
C  1.07512 -0.691359 -0.587767
C  1.863006 1.592578 0.094695
C  -0.651511 1.786021 -1.615104
C  0.129364 -1.455745 -1.216015
C  3.187579 0.998991 0.613547
C  2.492814 -1.076313 -0.606083
C  3.50771 -0.350703 -0.036344
C  -4.146498 -0.794086 -0.245629
C  4.958402 -0.827534 0.041308
C  5.380299 -1.021296 1.528276
C  5.251917 -2.103558 -0.776457
C  -4.964861 -2.623377 1.150257
H  -1.617082 -0.519573 0.852303
H  0.630356 0.275615 1.270457
H  -0.47437 3.08587 0.802914
H  -1.011965 1.766698 1.87055
H  -3.346465 0.834167 -1.306602
H  -1.678665 -0.819942 -2.213412
H  -1.920752 -2.069349 -0.993692
H  -2.74649 3.197878 -0.253088
H  -2.859682 3.380474 1.508172
H  -3.514084 0.984533 1.773548
H  -4.61747 1.786788 0.626405
H  2.007884 1.884334 -0.965251
H  1.642216 2.509984 0.668688
H  -0.084434 2.734331 -1.595197
H  -0.160727 1.114947 -2.341982
H  -1.658223 2.021269 -2.002506
H  0.447888 -2.352503 -1.767907
H  3.147205 0.89487 1.715167
H  2.722849 -2.036986 -1.085172
H  5.597435 -0.009596 -0.352933
H  4.370663 2.168637 -0.536737
H  4.752978 -1.791028 2.015548
H  5.287169 -0.077808 2.09288
H  6.435048 -1.347905 1.586884
H  4.97902 -1.980456 -1.840823
H  4.699297 -2.97538 -0.377891
H  6.330099 -2.341553 -0.727216
H  -6.020346 -2.327756 1.027339
H  -4.770241 -2.989133 2.168254
H  -4.717323 -3.390542 0.397071
