program: Gaussian 09
title: 000018615
version: EM64L-G09RevD.01
frameworkgroup: C1[X(C4H10N2O)]
method: RPBEPBE
basis: SDD
operation: Freq
keyword: #p
keyword: freq=noraman
keyword: PBEPBE/SDD
title: #p freq=noraman PBEPBE/SDD
converged: YES YES NO NO
title: Mulliken charges:
elementType: O N N C C C C H H H H H H H H H H
charge: -0.264527 -0.573102 -0.618994 -0.355053 -0.496427 -0.368957 0.232821 0.225541 0.231768 0.202654 0.227840 0.200290 0.174509 0.272501 0.264410 0.311492 0.333235
chargesum: 0.00000
title: Mulliken charges with hydrogens summed into heavy atoms:
elementType: O N N C C C C
charge: -0.264527 -0.036191 0.025732 0.102256 -0.065933 0.005841 0.232821
polarizability: 7.63258649e+01 2.74094310e+00 6.14784210e+01 1.79151378e+00 7.35539301e-01 4.42910942e+01
1716.lowfreq: -20.3611 -8.0543 0.0007 0.0007 0.0007 3.4772 34.0535 78.6080 108.4107
frequency: 33.7360 78.5880 108.4104 144.9396 240.2188 293.4569 353.9647 453.2940 496.7538 525.9057 590.1596 600.8835 678.9357 759.3877 847.6721 862.5988 959.4229 1041.7467 1053.8476 1076.0259 1109.3556 1133.0263 1209.8143 1252.4377 1278.1725 1282.6802 1321.0878 1367.4901 1388.5139 1446.1875 1474.1251 1492.7769 1593.9262 1638.8130 1642.7449 2853.9320 2971.0105 2994.7425 3003.3118 3025.1006 3068.0259 3457.3850 3516.1448 3585.6750 3674.2367
redmass: 3.1105 2.1117 2.6611 3.0872 1.1416 4.0379 2.9528 2.2474 1.2704 2.1290 1.5534 1.3592 2.2386 1.1568 2.1852 1.7550 1.8277 1.7664 3.1929 2.0816 2.4500 1.4423 1.3503 1.4436 1.1905 1.1433 1.6782 2.3041 1.4838 1.1022 1.0761 1.0906 1.4208 1.1400 3.2251 1.0716 1.0591 1.0703 1.0763 1.1003 1.1040 1.0448 1.0446 1.0977 1.1043
irintensity: 8.8921 8.5931 1.0688 6.1699 45.0128 6.1213 22.2896 16.4925 90.9525 115.2148 250.4316 42.8188 52.4406 15.2665 0.1661 3.9214 3.4776 2.4819 5.2228 0.7016 16.3301 4.0752 5.5966 31.9424 11.3969 3.6222 60.0405 106.0791 14.6668 12.8010 8.2300 6.4111 63.3761 97.6739 227.6655 126.4878 19.5132 12.4978 52.1140 10.7645 55.6752 1.0346 26.5726 0.3661 20.9497
temp: 298.150 k
press: 1.00000 atm
elementType: 8 7 7 6 6 6 6 1 1 1 1 1 1 1 1 1 1
symmnumber: 1
zpe: 382689.4 jmol-1
zpe.correction: 0.145759 hartree
zpe.thermalcorrener: 0.154536 hartree
zpe.thermalcorrenthalpy: 0.155480 hartree
zpe.thermalcorrgfe: 0.111521 hartree
zpe.sumelectzpe: -342.577480 hartree
zpe.sumelectthermal: -342.568703 hartree
zpe.sumelectthermalent: -342.567759 hartree
zpe.sumelectthermalfe: -342.611718 hartree
dipole: -0.0172 -3.7311 0.5615
dipole: 3.7732
quadrupole: -32.8720 -43.8518 -45.9514
quadrupole: 9.0036 6.7223 0.4336
quadrupole: 8.0197 -2.9601 -5.0596 9.0036 6.7223 0.4336
hfenergy: -342.7232387 hartree
pointgroup: C01 [X(C4H10N2O1)]
dipole: -0.0184208 1.3975283 -0.5002385 debye
dipolederiv: -0.6699988 0.1039903 -0.0375865 -0.0390677 -0.8063986 0.3302887 0.077663 0.2935015 -0.610943 -0.6020374 -0.1661415 -0.0164706 -0.1971408 -0.427255 -0.2446868 -0.0640445 -0.2454795 -0.6136135 -0.9186064 -0.4214462 0.3058705 -0.2534476 -0.5378342 -0.0631474 0.2382946 -0.0344743 -0.726906 0.004535 0.0015827 0.0188304 0.1267837 0.0219503 0.0145226 -0.0045594 -0.0161382 0.1216778 -0.3761248 0.0900637 -0.0269864 0.1673091 -0.012344 0.0066278 0.0020763 0.0083726 0.1741627 0.4820483 0.2218684 0.0771644 0.1495065 0.3556517 0.1160861 -0.0002264 0.0712756 0.4069188 1.3456091 0.1320226 -0.3244762 0.0333748 0.9191418 -0.5432625 -0.3808319 -0.5295274 0.6661502 0.0470593 -0.0013642 0.017354 0.0003102 0.0218104 -0.0956953 0.0244487 -0.1006304 -0.0980554 0.0910461 -0.0043317 -0.0033323 -0.0183772 -0.0309368 0.0855522 0.0247022 0.10418 -0.0077809 0.0134518 -0.0217857 0.0204073 -0.0312472 -0.0497793 0.1180971 0.0108432 0.1516035 -0.0522146 0.0882531 0.0390208 0.0327089 0.0059523 0.0165783 -0.0713277 -0.0105271 -0.105338 -0.0680872 0.0323147 -0.0131508 -0.0146337 -0.0077711 -0.1034808 0.1069303 -0.0331697 0.1405852 -0.0535904 -0.0555463 -0.0601061 -0.0337718 -0.0494043 -0.093571 -0.1499644 -0.0436253 -0.2051064 -0.2223481 -0.0287989 0.035045 -0.0028535 0.077211 0.1361011 0.0408766 0.1200264 0.0367476 0.3461785 0.1802865 -0.0252053 -0.0469234 -0.0452347 0.1562516 0.1224496 -0.0188498 0.2041184 0.1521729 0.2144125 0.0485388 0.0136463 0.0413164 0.2018337 0.1230489 0.0129406 0.1242218 0.2813927 0.1520961 0.0413992 0.0210525 0.0399265 0.2322809 0.1036042 0.044839 0.1020881 0.3048855 unknown
polarizability: 76.3678752|2.4635832|57.1438911|-1.5845115|-7.5649694|48.5836138 unknown
InChI: InChI=1S/C4H10N2O/c5-3-1-2-4(6)7/h1-3,5-6H2
charge 0 multiplicity 1
17 atoms
O  1.770059 -0.979723 1.050867
N  -3.320701 -0.402342 -0.131342
N  2.74647 0.607767 -0.326035
C  -0.859069 -0.154919 -0.032247
C  0.329629 0.811809 0.168066
C  -2.221332 0.555044 0.096708
C  1.657015 0.060634 0.337413
H  -0.803507 -0.638937 -1.024751
H  -0.775701 -0.959566 0.723983
H  0.38673 1.540642 -0.663837
H  0.167043 1.395107 1.09819
H  -2.297257 1.350513 -0.670966
H  -2.26019 1.0658 1.092677
H  -4.249761 0.021514 -0.208762
H  -3.313947 -1.199229 0.513455
H  2.662848 1.432142 -0.917507
H  3.65607 0.158143 -0.22061
