program: Gaussian 09
title: 000217158
version: EM64L-G09RevD.01
frameworkgroup: C1[X(C18H29NO)]
method: RPBEPBE
basis: SDD
operation: Freq
keyword: #p
keyword: freq=noraman
keyword: PBEPBE/SDD
title: #p freq=noraman PBEPBE/SDD
converged: YES YES NO NO
title: Mulliken charges:
elementType: O N C C C C C C C C C C C C C C C C C C H H H H H H H H H H H H H H H H H H H H H H H H H H H H H
charge: -0.442658 -0.057558 0.256151 -0.525190 -0.494299 -0.415459 -0.449917 0.443393 -0.363164 -0.367067 -0.385818 -0.513109 -0.424793 -0.699721 -0.343207 0.280874 -0.220254 -0.355107 -0.417940 -0.695800 0.207303 0.236563 0.233460 0.184345 0.171826 0.230133 0.201755 0.202849 0.208964 0.166100 0.190885 0.228832 0.206642 0.201284 0.262251 0.234310 0.217222 0.211392 0.207228 0.184888 0.182643 0.222012 0.193598 0.196981 0.219506 0.209915 0.209144 0.215646 0.352965
chargesum: 0.00000
title: Mulliken charges with hydrogens summed into heavy atoms:
elementType: O N C C C C C C C C C C C C C C C C C C
charge: -0.089692 -0.057558 0.256151 -0.081324 -0.076494 -0.013499 -0.045312 0.443393 0.011900 0.052649 0.022108 -0.250858 -0.190483 -0.063878 0.024324 0.280874 0.001758 0.035472 -0.198435 -0.061096
polarizability: 2.57506045e+02 2.19138406e+01 1.71460068e+02 -5.05362821e+00 5.67542428e+00 1.84310755e+02
1716.lowfreq: -11.9448 -7.1637 -0.0006 0.0001 0.0007 2.9714 5.7506 30.0198 40.7689
frequency: -4.4176 29.9663 40.7552 43.2957 60.3891 64.0119 78.8837 112.1298 120.0144 129.2037 131.7499 143.4941 189.6181 202.4378 220.0571 228.3871 230.7317 231.8294 276.8112 288.9371 304.0661 316.4107 347.2069 360.5802 366.0308 403.6251 443.8616 456.3072 489.9962 516.2477 524.5946 612.8229 624.1564 643.5879 702.3702 713.5157 727.9184 744.3089 759.1684 777.7829 810.6547 826.6957 844.4350 863.5993 867.0569 882.0186 882.7239 895.2164 896.3234 930.8648 957.5748 962.4769 977.9258 984.9075 989.2617 1010.3444 1017.7951 1044.3316 1053.3338 1064.8151 1074.4351 1093.2987 1094.2856 1109.3871 1112.8045 1121.3262 1136.3255 1147.6461 1157.7444 1172.7248 1182.7270 1190.0757 1197.2885 1210.7455 1228.5733 1235.8062 1242.7070 1251.2400 1265.3174 1272.3326 1280.8788 1288.4050 1290.9577 1294.5773 1305.5380 1312.1370 1319.7508 1339.5124 1344.7517 1348.4405 1354.3611 1383.1274 1385.6899 1388.0958 1388.4159 1451.4520 1458.6186 1462.9141 1463.7369 1465.0465 1471.5378 1473.4948 1476.6789 1477.0323 1478.4700 1481.1447 1485.7555 1488.1386 1488.7912 1499.3573 1587.7709 1626.5767 2803.2576 2832.3413 2884.3206 2952.3272 2954.8589 2965.9877 2970.5547 2971.3403 2974.6667 2975.5310 2992.1237 2995.3893 3006.0882 3007.1140 3011.2164 3019.7732 3034.7394 3037.3459 3045.0233 3068.1183 3068.9088 3070.4577 3070.9470 3074.3539 3114.3567 3136.2536 3157.3328 3162.7224 3582.5678
redmass: 4.0861 4.2650 3.5860 1.6247 2.5318 2.9321 2.4874 3.0149 1.7781 2.4536 2.7722 2.6998 4.2454 3.4573 3.2967 1.8604 1.1215 1.7067 2.8286 2.3831 2.4414 2.9610 3.9051 1.1143 2.6794 3.3195 3.0936 3.1869 3.0147 3.6034 5.6347 3.3105 3.9859 4.3665 1.9941 2.7840 1.0702 1.2163 1.1222 1.6161 2.8494 3.4128 1.2095 1.4003 1.5044 2.0850 1.6992 1.8081 1.7933 2.2603 1.3209 1.2081 2.0637 4.2729 2.4315 1.7977 2.4456 2.5759 2.6306 2.3289 2.3829 1.7809 2.0070 1.8477 2.1098 2.2355 2.5589 1.4046 1.6035 1.6130 1.1784 2.1145 1.8341 1.6027 1.4476 1.4500 1.6284 1.3747 1.6013 1.2755 1.0891 1.3654 1.1852 1.1994 1.2577 1.2995 1.5565 1.4392 1.4489 1.5057 1.6279 6.7661 1.4635 1.2116 1.2405 1.1374 2.3385 1.0992 1.1130 1.0678 1.0752 1.0657 1.2681 1.0428 1.5698 1.0775 1.1111 1.0885 1.0998 1.1014 6.3528 6.2707 1.0707 1.0712 1.0714 1.0587 1.0587 1.0592 1.0355 1.0364 1.0613 1.0630 1.0960 1.0862 1.0656 1.0935 1.0880 1.1023 1.0897 1.0986 1.1029 1.1008 1.1010 1.0992 1.0991 1.1046 1.0878 1.0905 1.0957 1.0931 1.0660
irintensity: 0.0784 0.1224 0.0511 0.0284 0.2700 0.4754 0.4472 0.3401 0.3740 1.0340 1.1693 0.4352 0.8656 2.3289 3.5381 0.2759 0.0312 0.5090 0.3922 1.1413 3.1656 3.1526 2.0210 134.0809 3.2868 6.8577 1.7770 0.6938 3.0891 3.2378 3.2176 3.3241 0.1751 1.3339 31.2548 8.5409 10.0520 13.2644 0.0535 43.2823 13.7830 12.3584 0.9429 9.7646 2.5110 4.3082 18.5062 14.7023 13.9033 26.3274 0.3159 0.7195 18.4825 0.6832 4.6690 3.1915 1.7897 1.4066 0.5428 3.5619 1.5185 22.4252 24.7447 3.7816 1.5116 0.1336 5.5797 154.3564 33.7208 12.6328 18.8546 8.6722 7.7346 6.0011 13.1275 2.0238 5.5038 3.6724 10.2350 8.3127 0.7794 6.4704 2.7168 15.3024 27.7792 1.7282 11.3147 1.2879 9.6587 1.5063 0.2117 15.1589 5.0058 11.0280 17.0002 4.1856 15.6346 1.7508 4.1247 0.0722 4.2188 1.4109 36.3644 12.4687 10.4019 0.1100 11.5846 17.5703 3.1986 14.8674 68.4232 74.9504 86.4611 108.5609 90.9265 11.2283 22.2644 29.8075 52.3437 45.1674 42.8983 28.4679 8.0758 30.8416 12.3098 23.7873 47.8634 4.7999 45.5177 22.6455 70.4921 94.6972 81.4248 57.0524 46.0338 33.8657 11.9708 23.8883 19.9271 0.1334 33.5405
temp: 298.150 k
press: 1.00000 atm
elementType: 8 7 6 6 6 6 6 6 6 6 6 6 6 6 6 6 6 6 6 6 1 1 1 1 1 1 1 1 1 1 1 1 1 1 1 1 1 1 1 1 1 1 1 1 1 1 1 1 1
symmnumber: 1
zpe: 1131772.5 jmol-1
zpe.correction: 0.431069 hartree
zpe.thermalcorrener: 0.452366 hartree
zpe.thermalcorrenthalpy: 0.453310 hartree
zpe.thermalcorrgfe: 0.380197 hartree
zpe.sumelectzpe: -831.700985 hartree
zpe.sumelectthermal: -831.679688 hartree
zpe.sumelectthermalent: -831.678744 hartree
zpe.sumelectthermalfe: -831.751857 hartree
dipole: -0.6580 0.6751 0.8866
dipole: 1.2941
quadrupole: -109.9963 -125.9351 -121.7321
quadrupole: 6.8347 -6.9837 -1.4543
quadrupole: 9.2248 -6.7139 -2.5109 6.8347 -6.9837 -1.4543
hfenergy: -832.1320546 hartree
pointgroup: C01 [X(C18H29N1O1)]
dipole: -0.286799 0.1488414 0.3934771 debye
polarizability: 250.1388025|33.1062003|177.0400869|0.420106|2.9017305|186.097978 unknown
InChI: InChI=1S/C18H29NO/c1-3-5-6-12-19-13-11-18(15-19,10-4-2)16-8-7-9-17(20)14-16/h7-9,14,20H,3-6,10-13,15H2,1-2H3
charge 0 multiplicity 1
49 atoms
O  -4.873965 -2.384495 -1.749472
N  1.492135 -0.128897 -0.08718
C  -0.936534 0.231762 -0.287372
C  -0.264856 -0.174479 -1.64806
C  0.266856 0.144239 0.721771
C  1.202548 0.257347 -1.486581
C  -1.441018 1.717394 -0.415573
C  -2.131254 -0.667088 0.070853
C  2.732069 0.41306 0.499762
C  -2.085565 2.346327 0.840063
C  4.006268 -0.05951 -0.229324
C  -2.969973 -1.158801 -0.958909
C  -2.474397 -0.968328 1.418007
C  -2.498719 3.815358 0.599435
C  5.298642 0.431672 0.460473
C  -4.106621 -1.938069 -0.654625
C  -3.61098 -1.750661 1.715806
C  6.583851 -0.001194 -0.28175
C  -4.439878 -2.245724 0.685271
C  7.873855 0.493103 0.407742
H  -0.751137 0.304337 -2.517075
H  -0.308834 -1.270238 -1.77918
H  0.136896 -0.662033 1.46702
H  0.362249 1.104966 1.28235
H  1.321039 1.358674 -1.663891
H  1.872562 -0.267314 -2.190399
H  -0.580867 2.345153 -0.728144
H  -2.180395 1.755981 -1.241941
H  2.780872 0.078654 1.55546
H  2.717086 1.537803 0.520217
H  -1.378598 2.302226 1.693289
H  -2.971984 1.75509 1.137134
H  3.996298 -1.166473 -0.274024
H  3.996908 0.302704 -1.277182
H  -2.756228 -0.955439 -2.012502
H  -1.858762 -0.589482 2.239877
H  -2.972582 4.252436 1.497608
H  -3.222236 3.891883 -0.234361
H  -1.622795 4.440404 0.340737
H  5.331565 0.046502 1.501324
H  5.27997 1.539345 0.53914
H  -3.857564 -1.976161 2.759417
H  6.54863 0.382473 -1.32206
H  6.603882 -1.107323 -0.359613
H  -5.322217 -2.855184 0.920504
H  7.949146 0.097691 1.438466
H  7.890618 1.597716 0.471379
H  8.777115 0.172572 -0.143485
H  -5.639601 -2.929378 -1.440399
