program: Gaussian 09
title: 000018613
version: EM64L-G09RevD.01
frameworkgroup: C1[X(C6H6O2)]
method: RPBEPBE
basis: SDD
operation: Freq
keyword: #p
keyword: freq=noraman
keyword: PBEPBE/SDD
title: #p freq=noraman PBEPBE/SDD
converged: NO NO NO NO
title: Mulliken charges:
elementType: O O C C C C C C H H H H H H
charge: -0.191125 -0.191168 -0.158871 -0.158777 -0.212417 -0.212310 -0.107360 -0.107368 0.237989 0.237967 0.263942 0.263845 0.167869 0.167784
chargesum: 0.00000
title: Mulliken charges with hydrogens summed into heavy atoms:
elementType: O O C C C C C C
charge: -0.191125 -0.191168 0.079118 0.079189 0.051525 0.051535 0.060509 0.060416
polarizability: 1.96534009e+02 -1.08231152e+01 5.81770425e+01 -6.87387446e-03 9.76289771e-04 2.84142968e+01
1716.lowfreq: -0.0009 -0.0007 -0.0006 4.7574 7.7814 54.9454 61.5381 87.6633 146.9912
frequency: 61.5350 87.6633 146.9675 204.2918 231.1661 247.5130 323.4183 384.0038 431.4470 574.1109 596.6309 825.0834 902.6081 960.7391 979.0836 987.9004 1023.8730 1098.3270 1135.0593 1180.6178 1197.9083 1271.1398 1286.4802 1291.4368 1377.2822 1388.0263 1565.6721 1598.4067 1615.6072 1632.4906 2867.6583 2868.8922 3081.5836 3093.2452 3125.5748 3127.0464
redmass: 9.5790 7.0284 5.8091 1.9314 5.0515 3.1663 8.8650 2.2338 3.8351 5.4691 3.5086 1.3106 1.7018 1.2141 1.8231 1.7614 1.0958 3.7419 3.8428 2.3656 1.1954 1.8997 1.2686 1.3450 1.2144 1.2857 8.5153 6.1600 5.1199 5.4187 1.0853 1.0857 1.0917 1.0908 1.0921 1.0919
irintensity: 10.9866 14.0735 0.0004 15.0353 0.0003 3.9888 0.0002 0.0001 27.2253 11.8221 0.0001 6.3825 0.0014 0.0016 2.3289 0.0008 123.1428 264.1349 0.0052 0.0006 16.9796 0.0001 0.0000 0.0886 20.3024 0.0022 104.2695 0.0082 487.1385 0.0976 215.1614 1.0752 0.0030 15.5707 5.7408 7.9885
temp: 298.150 k
press: 1.00000 atm
elementType: 8 8 6 6 6 6 6 6 1 1 1 1 1 1
symmnumber: 1
zpe: 267787.0 jmol-1
zpe.correction: 0.101995 hartree
zpe.thermalcorrener: 0.110363 hartree
zpe.thermalcorrenthalpy: 0.111307 hartree
zpe.thermalcorrgfe: 0.068512 hartree
zpe.sumelectzpe: -382.042203 hartree
zpe.sumelectthermal: -382.033834 hartree
zpe.sumelectthermalent: -382.032890 hartree
zpe.sumelectthermalfe: -382.075685 hartree
dipole: 0.0021 0.0005 -0.0080
dipole: 0.0083
quadrupole: -85.8929 -40.3978 -48.0534
quadrupole: 6.9633 -0.0271 0.0072
quadrupole: -27.7782 17.7169 10.0613 6.9633 -0.0271 0.0072
hfenergy: -382.1441973 hartree
pointgroup: C01 [X(C6H6O2)]
dipole: -0.0008181 -0.0001938 -0.0031629 debye
dipolederiv: -1.245785 0.0805437 -0.0014378 0.1755119 -0.4545994 0.0007584 0.0028748 -0.0009412 -0.3342111 -1.2454166 0.0805803 -0.000494 0.1753615 -0.4546281 0.0001188 -0.0003232 -0.000077 -0.3342412 0.2686713 -0.0203814 0.0006686 -0.0084665 0.1207663 0.0002772 -0.0031466 0.0002043 -0.114974 0.2693784 -0.0204547 0.0001456 -0.0084531 0.1208637 -0.0002248 -0.0000997 0.0000879 -0.1149142 -0.8808339 -0.0287913 0.0000182 -0.4315716 0.0470512 0.0005055 0.001487 0.0000533 -0.1318717 -0.8815939 -0.0288035 -0.0002783 -0.4313124 0.0472537 -0.0000113 0.0002323 0.0000027 -0.131822 1.709305 -0.0963326 0.0007172 0.4544713 0.6946712 -0.0021215 -0.0009973 -0.0013946 0.120568 1.7091263 -0.0964347 0.0008139 0.4544536 0.6948224 0.0001942 0.0010202 0.0000462 0.1205144 0.0502904 -0.0049377 -0.0000085 -0.0449438 -0.0833402 -0.000104 -0.0001727 -0.0000166 0.1664241 0.0502801 -0.0049477 -0.0000899 -0.0449181 -0.0834178 -0.0001055 -0.0003461 -0.0001045 0.1664159 0.0548137 -0.0258994 0.0000913 -0.0610096 -0.0607661 -0.0000254 -0.0009793 -0.0003846 0.1779361 0.054793 -0.0258383 -0.0000922 -0.0609693 -0.0610311 -0.0001201 -0.0001215 -0.000113 0.177886 0.0434601 0.0958277 -0.0000254 -0.084065 -0.2637151 0.000944 0.000545 0.0025009 0.116168 0.0435114 0.0958696 -0.0000286 -0.084089 -0.2639307 -0.0000855 0.0000271 0.0001362 0.1161217 unknown
polarizability: 196.5979741|-10.4060418|58.1130686|0.0036616|0.0156559|28.4143053 unknown
InChI: InChI=1S/C6H6O2/c7-5-3-1-2-4-6-8/h1-6H
charge 0 multiplicity 1
14 atoms
O  -4.257502 0.191687 0.004126
O  4.260555 -0.192129 0.001025
C  -0.646289 -0.327008 -0.001591
C  0.649093 0.326578 -0.000549
C  -1.846393 0.346826 -0.002128
C  1.849118 -0.347027 0.000004
C  -3.130262 -0.376177 -0.003682
C  3.133066 0.375466 0.001191
H  -0.6551 -1.428523 -0.002097
H  0.657986 1.428124 -0.000117
H  -1.892216 1.444451 -0.001635
H  1.895177 -1.444796 -0.000388
H  -3.044074 -1.49385 0.003826
H  3.04684 1.493176 0.000916
