program: Gaussian 09
title: 000207946
version: EM64L-G09RevD.01
frameworkgroup: C1[X(C20H25N)]
method: RPBEPBE
basis: SDD
operation: Freq
keyword: #pfreq=noraman
keyword: PBEPBE/SDD
title: #p freq=noraman PBEPBE/SDD
converged: YES YES NO NO
title: Mulliken charges:
elementType: N C C C C C C C C C C C C C C C C C C C C H H H H H H H H H H H H H H H H H H H H H H H H H
charge: -0.359322 0.374044 0.176855 -0.555272 -0.686854 0.359736 -0.650659 0.324119 -0.747652 -0.753180 -0.408440 0.497488 -0.435892 -0.670981 -0.281627 -0.254316 -0.401495 -0.403790 -0.245737 -0.244755 -0.242255 0.238959 0.191580 0.202186 0.264520 0.203429 0.220122 0.212547 0.210161 0.224441 0.210983 0.276242 0.192779 0.257084 0.228938 0.231672 0.233118 0.204441 0.221931 0.222086 0.223377 0.230191 0.233458 0.224023 0.223810 0.227907
chargesum: 0.00000
title: Mulliken charges with hydrogens summed into heavy atoms:
elementType: N C C C C C C C C C C C C C C C C C C C C
charge: -0.102238 0.374044 0.176855 -0.124733 -0.220149 0.359736 -0.227107 0.324119 -0.100504 -0.073175 -0.179501 0.497488 -0.204221 -0.011491 -0.059541 -0.030939 -0.171304 -0.170332 -0.021714 -0.020945 -0.014348
polarizability: 2.45214537e+02 6.23355032e+00 2.09345876e+02 -1.00453473e+01 1.86398070e+01 1.92962414e+02
1716.lowfreq: -5.4787 -0.0007 -0.0006 -0.0003 5.8709 18.3522 28.1522 43.1415 65.0813
frequency: 27.4791 43.1219 65.0636 70.7953 99.3776 120.1737 139.6411 174.2866 190.5049 202.5373 215.5575 234.8474 242.8808 262.1768 278.7801 294.3592 308.4661 335.6108 353.9725 365.0394 382.0358 397.8644 406.5834 428.5559 454.0074 480.7815 506.7951 527.1033 543.6552 557.5235 573.9213 601.0652 618.1146 635.6346 698.6462 708.4969 730.3804 757.9851 765.7341 783.6488 807.6766 823.9875 853.9954 863.3761 866.7353 887.3011 901.7519 914.2644 923.3276 926.1287 945.8774 957.5392 974.8774 981.6295 989.9616 991.3515 1001.4669 1018.6701 1027.5172 1039.0193 1051.2047 1064.5876 1081.9528 1094.3056 1111.2501 1123.5153 1132.8153 1151.9219 1162.9619 1171.4117 1173.9837 1181.9508 1188.3137 1204.7531 1216.5078 1224.5040 1242.0900 1273.2400 1282.9792 1293.0978 1309.5474 1330.7871 1335.6207 1349.3429 1364.0235 1378.1083 1381.1311 1389.5337 1431.6818 1437.3760 1438.5881 1445.7022 1453.0383 1460.9819 1466.1257 1469.6726 1475.0819 1477.1915 1479.8254 1481.8693 1484.6745 1495.6150 1506.4953 1588.1416 1589.4894 1611.0545 1611.7318 2893.9503 2952.8433 2967.9923 2969.3652 2970.9817 2974.6873 3010.8256 3015.8776 3028.7640 3031.8900 3057.2758 3064.2231 3069.6175 3077.2589 3103.4990 3105.7933 3113.5161 3117.1624 3118.4926 3131.8528 3134.7085 3142.4618 3156.0566 3161.3690 3468.1057
redmass: 4.0070 4.2840 3.7593 3.6689 3.4173 2.7998 2.3565 3.3327 2.6814 3.2793 1.3884 1.3913 1.7996 2.2047 1.2741 2.6858 2.6560 3.1275 2.0033 2.7509 2.3184 2.7655 2.8466 3.5847 2.8861 2.1107 2.6082 2.9642 3.3378 3.2010 2.7108 3.7659 6.2485 4.4611 4.2630 1.7074 2.1837 2.1142 1.5843 2.7073 3.2540 3.9608 1.2828 2.3232 1.5464 1.9454 1.7906 1.6425 1.5033 1.9286 1.4522 1.9656 1.3817 1.3258 6.1887 1.3333 1.7284 1.7504 2.1793 2.5535 2.2581 1.7862 2.1257 1.6768 1.4593 2.4221 1.7937 1.4118 1.6279 1.0726 1.0936 1.9534 1.1276 2.0972 2.5672 2.2706 1.8548 1.4461 1.9163 1.9809 1.6150 1.2835 1.3914 1.7203 1.1895 5.5258 6.8613 1.2412 1.1511 2.2376 2.1182 1.1722 1.0889 1.1033 1.0804 1.1321 1.1150 1.1183 1.1258 2.0843 1.5870 1.2511 1.0571 5.9036 7.0105 6.1025 6.2770 1.0546 1.0627 1.0375 1.0479 1.0573 1.0495 1.0960 1.0759 1.0992 1.1008 1.0983 1.0987 1.0996 1.0994 1.0983 1.0872 1.0867 1.0863 1.0866 1.0910 1.0929 1.0959 1.1005 1.1014 1.0749
irintensity: 0.0236 0.0083 0.0597 0.1377 0.0491 0.8232 0.7025 0.1126 0.2469 2.1265 0.7005 1.7399 2.1060 0.3118 0.0652 1.2412 0.4812 1.7016 0.8270 2.9259 4.4382 5.0609 0.0216 1.5802 10.1972 18.7429 45.9033 9.9633 4.1486 8.5479 63.3735 8.0182 0.0958 6.1672 1.7578 63.2235 19.3645 26.9640 48.3734 8.2121 0.6971 2.0243 0.6231 6.8990 1.1732 1.5274 1.9728 1.1179 3.2939 1.9322 2.1170 12.2527 0.0942 0.0536 0.0244 0.8000 21.6631 12.8255 14.8547 12.5443 4.8280 7.3740 9.0357 16.5786 0.7057 22.5022 13.2200 4.8560 19.4463 0.8202 1.3521 8.6685 0.6146 5.2911 2.4430 3.1932 11.6738 3.0294 4.6746 1.8800 17.6206 0.7556 31.3426 15.4339 16.0335 2.6283 0.2712 11.1757 7.9925 9.1419 4.9483 13.3478 1.4080 1.9948 1.3123 11.8193 23.4345 9.1875 4.2746 18.6681 3.9014 29.1437 16.0896 1.6245 2.9282 16.4259 1.7862 132.4862 26.0989 30.0633 11.4925 51.9058 57.9215 12.1337 46.2217 23.6810 22.5306 15.6370 67.9457 35.5141 38.9475 8.1285 14.3473 10.3476 5.8047 3.2618 12.0563 36.5950 43.7963 40.3725 24.6787 1.5214
temp: 298.150 k
press: 1.00000 atm
elementType: 7 6 6 6 6 6 6 6 6 6 6 6 6 6 6 6 6 6 6 6 6 1 1 1 1 1 1 1 1 1 1 1 1 1 1 1 1 1 1 1 1 1 1 1 1 1
symmnumber: 1
zpe: 1039483.1 jmol-1
zpe.correction: 0.395918 hartree
zpe.thermalcorrener: 0.415557 hartree
zpe.thermalcorrenthalpy: 0.416501 hartree
zpe.thermalcorrgfe: 0.348784 hartree
zpe.sumelectzpe: -830.326231 hartree
zpe.sumelectthermal: -830.306592 hartree
zpe.sumelectthermalent: -830.305648 hartree
zpe.sumelectthermalfe: -830.373365 hartree
dipole: -1.0196 0.7666 -0.7456
dipole: 1.4775
quadrupole: -129.3541 -121.8496 -119.4743
quadrupole: 1.5059 -0.7457 3.4302
quadrupole: -5.7947 1.7098 4.0850 1.5059 -0.7457 3.4302
hfenergy: -830.7221491 hartree
pointgroup: C01 [X(C20H25N1)]
dipole: -0.4167597 -0.2875182 0.2855732 debye
polarizability: 244.4801416|-8.7163447|208.7781165|10.3991161|18.6946313|194.2645697 unknown
InChI: InChI=1S/C20H25N/c1-19(2)15-20(21-3,13-16-9-5-4-6-10-16)14-17-11-7-8-12-18(17)19/h4-12,21H,13-15H2,1-3H3
charge 0 multiplicity 1
46 atoms
N  0.526613 -1.858266 1.592093
C  -0.261285 -0.920125 0.749377
C  1.463209 -0.994144 -1.263917
C  -0.007026 -1.163499 -0.761486
C  0.218332 0.512273 1.075087
C  2.200663 0.139943 -0.519874
C  -1.809753 -1.058395 1.080018
C  1.631398 0.812761 0.597562
C  1.384974 -0.676721 -2.788611
C  2.261727 -2.320336 -1.075667
C  3.506342 0.513143 -0.935832
C  -2.768178 -0.097981 0.394806
C  2.374905 1.823525 1.258602
C  0.179813 -3.287475 1.615324
C  4.237364 1.525116 -0.280183
C  3.667789 2.188172 0.830742
C  -3.135924 1.128668 1.011676
C  -3.340456 -0.404182 -0.869502
C  -4.028405 2.025722 0.383501
C  -4.233443 0.488565 -1.502978
C  -4.579595 1.710558 -0.880133
H  -0.647732 -0.443924 -1.306703
H  -0.360243 -2.173619 -1.052804
H  0.143063 0.694422 2.168071
H  -0.483268 1.224401 0.59875
H  -1.901173 -0.949087 2.180061
H  -2.102236 -2.098244 0.835562
H  2.386768 -0.645087 -3.253449
H  0.800406 -1.460176 -3.308223
H  0.893839 0.297225 -2.968564
H  3.287813 -2.225851 -1.475668
H  2.32355 -2.572661 -0.004907
H  1.763907 -3.148147 -1.617772
H  0.701134 -1.475352 2.528403
H  3.965557 0.002182 -1.790362
H  1.926997 2.331887 2.122386
H  0.216152 -3.703916 0.592589
H  -0.822402 -3.529561 2.0409
H  0.935697 -3.829589 2.21264
H  5.241932 1.790294 -0.628892
H  4.224106 2.973066 1.355528
H  -2.724957 1.375847 1.998751
H  -3.089074 -1.355343 -1.354871
H  -4.298071 2.964703 0.880475
H  -4.664518 0.229003 -2.476756
H  -5.274611 2.402705 -1.36855
