program: Gaussian 09
title: 000226198
version: EM64L-G09RevD.01
frameworkgroup: C1[X(C7H15NO)]
method: RPBEPBE
basis: SDD
operation: Freq
keyword: #p
keyword: freq=noraman
keyword: PBEPBE/SDD
title: #p freq=noraman PBEPBE/SDD
converged: YES YES NO NO
title: Mulliken charges:
elementType: O N C C C C C C C H H H H H H H H H H H H H H H
charge: -0.283574 -0.383027 -0.137223 -0.404581 -0.392642 0.237174 -0.709207 -0.697747 -0.611855 0.184813 0.245045 0.194288 0.199352 0.205161 0.196999 0.216453 0.236863 0.223371 0.253257 0.203364 0.299748 0.276694 0.223606 0.223667
chargesum: 0.00000
title: Mulliken charges with hydrogens summed into heavy atoms:
elementType: O N C C C C C C C
charge: -0.283574 -0.083278 0.047590 0.034752 0.011871 0.237174 -0.058891 -0.017756 0.112112
polarizability: 9.72138962e+01 4.63677951e-01 8.12751379e+01 -4.12930934e+00 2.06626949e-01 7.87418642e+01
1716.lowfreq: -11.8643 -0.0010 -0.0007 -0.0006 8.9584 23.1008 30.3566 86.2254 96.7380
frequency: 29.0015 86.1656 96.6884 110.0628 132.4747 180.6002 192.9287 214.7016 250.2016 282.0294 303.2190 337.5577 428.3226 500.2867 573.2768 637.2207 719.1742 778.4812 789.9347 834.7471 880.7791 917.6394 1018.1189 1026.9455 1044.1828 1060.6212 1093.0518 1116.5807 1122.3506 1135.1632 1166.4051 1209.3816 1246.4994 1260.1813 1271.8436 1327.8340 1349.1195 1362.9429 1388.7890 1401.5029 1414.8845 1452.7833 1458.3476 1466.6383 1477.4129 1478.6375 1483.7599 1487.2017 1491.1147 1510.5084 1615.5629 2940.0033 2970.2384 2972.3456 2975.5531 2985.5587 2988.8043 3018.0442 3047.4263 3054.1942 3071.2853 3077.2992 3079.1233 3093.8059 3105.7673 3556.7169
redmass: 4.1467 2.2227 2.1201 1.1285 2.2936 2.6022 1.4577 1.7001 1.6259 2.0185 2.4600 3.7647 3.1745 3.1410 1.1360 2.7597 3.4196 1.3420 1.6103 2.2683 2.0461 2.0273 1.3277 3.4612 1.4640 2.7118 1.9175 1.7172 1.4709 1.7048 2.3136 1.9653 1.3909 1.2504 1.1757 1.4055 1.4238 1.4802 1.2160 1.2100 1.1807 1.3275 1.0756 1.0836 1.0468 1.0476 1.0481 1.0464 1.0539 1.4061 5.9059 1.0797 1.0595 1.0386 1.0348 1.0627 1.0377 1.1016 1.0974 1.1024 1.0990 1.0992 1.1005 1.1001 1.0980 1.0774
irintensity: 6.9334 0.9481 0.6527 0.4313 0.4285 1.9965 1.4027 4.8116 1.4350 1.8924 4.7897 12.5418 5.7034 0.5400 107.0300 2.0505 4.1500 2.7147 12.0642 1.9370 9.2921 6.6084 4.2366 5.9736 6.7092 8.6702 1.6647 0.6366 0.6894 56.4568 2.7740 68.5846 12.1294 11.3825 0.8592 0.8698 1.0696 3.7801 10.9101 33.6868 28.1281 71.9544 8.7400 10.2646 19.7340 2.2531 10.4896 13.5808 9.8395 107.6332 125.4368 28.4337 57.2188 43.8614 81.4834 24.7002 31.2432 30.6004 3.5135 38.8211 38.2942 60.7613 44.7739 33.9076 2.1269 14.7859
temp: 298.150 k
press: 1.00000 atm
elementType: 8 7 6 6 6 6 6 6 6 1 1 1 1 1 1 1 1 1 1 1 1 1 1 1
symmnumber: 1
zpe: 557160.9 jmol-1
zpe.correction: 0.212211 hartree
zpe.thermalcorrener: 0.223907 hartree
zpe.thermalcorrenthalpy: 0.224852 hartree
zpe.thermalcorrgfe: 0.174323 hartree
zpe.sumelectzpe: -404.983731 hartree
zpe.sumelectthermal: -404.972035 hartree
zpe.sumelectthermalent: -404.971091 hartree
zpe.sumelectthermalfe: -405.021619 hartree
dipole: 0.8668 -0.0938 -3.6770
dipole: 3.7790
quadrupole: -50.0966 -57.5533 -59.2241
quadrupole: -0.2418 -3.5159 0.1470
quadrupole: 5.5281 -1.9286 -3.5994 -0.2418 -3.5159 0.1470
hfenergy: -405.1959421 hartree
pointgroup: C01 [X(C7H15N1O1)]
dipole: 0.3230663 -0.0842459 -1.4487913 debye
dipolederiv: -0.6634593 -0.0173749 -0.0751239 -0.0060909 -0.3803194 -0.0166661 0.2559248 -0.0263968 -0.942349 -1.0452379 -0.0257074 0.3277354 -0.0180447 -0.475381 0.0049158 0.2358901 0.0147809 -0.4435366 -0.1571672 -0.0543684 -0.0697662 -0.1033908 -0.0142655 -0.0682482 -0.0896917 -0.0537562 0.073729 0.1226792 -0.0220903 0.046322 -0.0298728 0.0514801 0.0005297 -0.0150372 -0.0030087 0.0588295 0.1076826 0.023403 0.0076502 0.1074253 0.1579146 0.0329075 -0.0206029 -0.0140833 0.0940855 1.3052854 0.0967859 -0.2764993 0.0599659 0.1130398 0.0164527 -0.5075167 0.0259663 1.1017022 0.0435802 0.0055387 0.0006229 -0.0093494 -0.0656158 -0.0100147 0.0108792 -0.0178398 0.1061075 0.0526235 -0.0378165 0.0011284 -0.0476225 -0.0056415 0.0660217 0.0104603 0.0513575 -0.0525937 0.4302479 0.0078931 -0.012393 0.0052593 0.2809272 -0.0045932 0.2323799 0.0041944 -0.0072178 -0.0109064 -0.0283439 0.0690018 -0.0216644 -0.0051518 0.0934111 0.0429902 0.0774087 -0.1691515 0.1058306 -0.0060364 0.0027413 -0.0047544 0.0335504 0.0583625 0.0563701 0.0529545 -0.0814068 -0.1669589 -0.0550512 -0.0713366 -0.0563531 0.0078514 -0.0393905 -0.0970277 -0.037825 0.0440586 -0.0573498 0.1057822 0.125617 0.0761351 -0.0556365 -0.0463499 0.1019915 -0.0440367 -0.0166808 -0.1117085 -0.0487515 -0.1431088 -0.0446531 0.0294093 0.016249 -0.1164129 0.0189084 -0.0536183 0.0872382 -0.0218529 0.0235422 -0.0077855 0.0341999 0.027752 0.0047377 0.1077463 -0.1734466 -0.0539425 0.1418497 0.0821225 0.1122929 -0.0505143 -0.0531152 0.0905677 -0.0743563 0.0507202 -0.0910437 -0.0916623 -0.0825147 -0.0555561 0.0702709 -0.0013398 -0.0832862 -0.0244948 0.0433855 -0.0724024 0.0780833 0.090102 0.1146136 0.0613112 -0.0549664 0.0816189 -0.0266167 0.0194698 -0.0232543 0.0199451 -0.1035859 0.0120184 0.1284654 -0.0268283 -0.086086 0.0095531 -0.0029219 0.07168 -0.0674131 0.0086597 -0.0850455 -0.2092634 -0.0011393 -0.0013283 -0.0365615 0.07748 0.1336861 -0.0018544 -0.0577332 0.0007082 0.3264999 -0.001273 -0.0725666 -0.0054343 0.0909191 0.1736799 0.004853 0.0557231 -0.0006804 0.125915 -0.0023492 -0.0818603 -0.0070065 -0.0165827 -0.0856476 -0.0773634 0.0266262 -0.1467579 -0.080181 0.0732935 0.0260932 0.0853316 0.0964235 -0.0951352 0.0715526 0.0244671 0.1492029 -0.0788649 -0.0636218 0.021513 -0.0767854 0.1025952 unknown
polarizability: 96.9547424|1.3553053|81.4018753|-4.4536213|-0.2301095|78.8742806 unknown
InChI: InChI=1S/C7H15NO/c1-4-6(5-2)7(9)8-3/h6,8H,4-5H2,1-3H3
charge 0 multiplicity 1
24 atoms
O  0.759054 0.101774 1.406135
N  1.815139 0.08545 -0.667054
C  -0.65425 -0.042438 -0.62037
C  -1.733991 0.841965 0.049799
C  -1.085059 -1.542496 -0.731934
C  0.682676 0.066865 0.138094
C  -1.460183 2.352849 -0.106652
C  -1.422747 -2.229589 0.609594
C  3.17497 0.122771 -0.117199
H  -0.49933 0.326997 -1.658382
H  -1.774956 0.588128 1.124567
H  -2.72007 0.58984 -0.389456
H  -0.277469 -2.109199 -1.238607
H  -1.968472 -1.587642 -1.400689
H  -1.407307 2.645985 -1.173093
H  -2.258653 2.951974 0.367864
H  -0.504709 2.630181 0.374801
H  -2.302381 -1.766814 1.091275
H  -0.580714 -2.159429 1.319564
H  -1.654079 -3.298211 0.445274
H  1.692214 0.079058 -1.680454
H  3.080585 0.149283 0.98052
H  3.721087 1.024341 -0.451762
H  3.753943 -0.774644 -0.405538
