program: Gaussian 09
title: 000226199
version: EM64L-G09RevD.01
frameworkgroup: C1[X(C11H9NO2)]
method: RPBEPBE
basis: SDD
operation: Freq
keyword: #p
keyword: freq=noraman
keyword: PBEPBE/SDD
title: #p freq=noraman PBEPBE/SDD
converged: YES YES NO NO
title: Mulliken charges:
elementType: O O N C C C C C C C C C C C H H H H H H H H H
charge: -0.475263 -0.238262 -0.469551 0.292407 0.355643 -0.374579 0.255806 -0.346737 -0.377815 -0.380391 -0.232864 -0.236828 -0.240540 0.074875 0.349300 0.248146 0.271895 0.233533 0.213153 0.229225 0.229094 0.233284 0.386469
chargesum: 0.00000
title: Mulliken charges with hydrogens summed into heavy atoms:
elementType: O O N C C C C C C C C C C C
charge: -0.088794 -0.238262 -0.120251 0.292407 0.355643 -0.126433 0.255806 -0.074842 -0.144282 -0.167238 -0.003640 -0.007734 -0.007256 0.074875
polarizability: 2.52486211e+02 -3.22822407e+00 1.35265984e+02 2.42539993e+00 2.48594064e+00 5.38837544e+01
1716.lowfreq: -11.5749 -2.9778 0.0006 0.0009 0.0009 7.3220 31.3542 67.2459 87.9726
frequency: 31.2661 67.2440 87.9606 119.3411 169.2831 194.3504 288.1963 295.6430 400.0605 408.3331 423.3105 494.2390 530.1723 536.4780 608.8765 615.1940 638.6956 667.2062 670.5008 681.5333 696.0290 713.6097 770.8761 805.3744 842.4547 895.6799 914.8737 920.2657 932.5955 973.2158 987.5558 995.4308 1014.0032 1024.8269 1056.9290 1066.2991 1085.8801 1174.6409 1176.4872 1196.5679 1247.7010 1294.7371 1310.3063 1349.2196 1368.4078 1396.3041 1410.2134 1448.3412 1462.4814 1515.5240 1560.3996 1586.2362 1617.1166 1671.3960 3119.4796 3130.9436 3142.8110 3153.3886 3168.9534 3217.9262 3240.6582 3553.2825 3595.0491
redmass: 3.9852 8.5358 6.1216 4.9450 5.2367 5.2501 7.6370 4.7710 2.8787 4.8901 5.8242 3.3587 1.3238 4.9161 3.0987 6.3839 4.7426 1.3765 2.3244 5.7480 1.8881 4.7455 1.6350 1.5935 1.2628 1.3881 1.5402 5.1308 7.1826 1.4227 5.5364 1.3269 2.5485 2.4565 1.2739 2.1226 1.6251 1.1386 1.5110 1.1280 1.5121 1.8415 1.6276 4.2330 3.4670 6.3783 4.8501 2.6828 2.5648 5.6248 4.4255 5.8186 6.0043 8.6196 1.0869 1.0860 1.0915 1.0960 1.1016 1.0933 1.1040 1.0646 1.0806
irintensity: 0.3265 0.2663 0.4182 0.4633 0.1331 0.2365 0.7650 0.6670 0.2338 2.2620 19.2375 22.0869 113.8433 8.3820 21.6703 0.6191 11.3195 37.2521 4.5652 5.0893 33.3147 68.9623 124.6521 49.5169 0.1686 2.8520 6.7114 2.8767 154.1793 0.6032 1.6250 0.3090 179.2774 8.0506 22.8286 69.1986 12.3360 15.4532 58.8523 1.8782 2.0824 113.7427 7.6382 34.0403 4.2912 24.0773 9.9783 6.5755 75.0682 38.4870 13.3565 4.1559 22.8478 715.8874 11.0533 1.1767 12.8818 33.7431 22.8293 2.4626 0.6162 56.6755 66.9086
temp: 298.150 k
press: 1.00000 atm
elementType: 8 8 7 6 6 6 6 6 6 6 6 6 6 6 1 1 1 1 1 1 1 1 1
symmnumber: 1
zpe: 458961.4 jmol-1
zpe.correction: 0.174809 hartree
zpe.thermalcorrener: 0.186237 hartree
zpe.thermalcorrenthalpy: 0.187181 hartree
zpe.thermalcorrgfe: 0.136143 hartree
zpe.sumelectzpe: -628.816416 hartree
zpe.sumelectthermal: -628.804989 hartree
zpe.sumelectthermalent: -628.804045 hartree
zpe.sumelectthermalfe: -628.855083 hartree
dipole: 3.3848 -1.6107 0.2069
dipole: 3.7542
quadrupole: -84.8830 -67.7078 -85.9616
quadrupole: 7.4997 -0.1253 0.4715
quadrupole: -5.3655 11.8097 -6.4442 7.4997 -0.1253 0.4715
hfenergy: -628.9912254 hartree
pointgroup: C01[X(C11H9N1O2)]
dipole: -1.3413895 -0.6132502 -0.0784242 debye
dipolederiv: -0.3305678 -0.0634674 -0.0082948 0.4774568 -1.3227822 -0.0900814 0.0470584 -0.0867614 -0.4618538 -1.6721484 -0.0619191 -0.0104906 -0.1199339 -0.5637671 -0.0252806 -0.0018786 -0.0226093 -0.3391808 0.3515264 -0.121847 -0.0030424 -0.105677 -0.6145391 -0.0312557 0.0697405 0.0083767 -0.2034509 -0.0445622 -0.0333646 -0.0172139 0.4180778 0.2176675 0.0370696 -0.006578 -0.01472 0.025707 0.5645519 0.1378778 0.0162475 0.121978 0.0142673 -0.0015246 0.0174036 0.018529 0.0435823 -0.3973438 0.0367064 -0.0009472 -0.2821059 -0.0091785 0.0284136 -0.0578768 0.0235091 -0.2304238 -1.3433672 0.4266507 0.0410445 0.7083785 -0.1370269 -0.0180839 0.0451617 -0.016176 -0.0161108 0.274101 -0.082411 -0.0059454 -0.2102721 0.124568 0.0261349 0.010843 0.0299548 -0.1705274 -0.2815165 0.0006228 -0.0089763 0.0523117 0.0588542 -0.0491266 -0.032782 -0.0453296 -0.1451175 -0.1403895 -0.0626615 0.0387108 -0.1532385 -0.0498184 -0.0563906 0.0531749 -0.0441235 -0.1541838 0.1325828 -0.0728895 0.0357046 -0.1102783 0.0541417 -0.0489361 0.0720442 -0.0498352 -0.1265705 -0.0513747 0.0356323 0.0019139 0.1360649 0.1302476 -0.0512314 -0.0340038 -0.0612665 -0.1276853 -0.0455218 0.031609 0.0094247 -0.0462797 -0.0873368 -0.0154687 0.0217354 -0.0141871 -0.167053 2.5197761 -0.2278521 -0.0171251 -0.7865288 1.5863737 0.1374224 -0.0951752 0.1275537 0.2576966 0.2708895 -0.0359431 -0.0002772 -0.0560073 0.2262334 -0.0054162 -0.0193069 -0.011789 0.3096712 0.0552406 0.0988904 0.0087486 0.0802083 0.0222876 -0.0206087 0.0110887 -0.0175122 0.1855062 0.0394752 -0.0706413 -0.007994 -0.0484602 0.0707344 -0.0124236 -0.0066866 -0.0100887 0.1897151 0.0915973 -0.0761358 0.0115929 -0.0529627 -0.0600667 0.0468525 0.0094894 0.0419329 0.1385819 -0.0160618 0.1139092 -0.0444416 0.0937879 0.0073696 0.0444718 -0.0434839 0.0395436 0.1346915 -0.0350572 0.0889163 -0.0333962 0.1188309 -0.0097603 0.0456811 -0.0427344 0.0437541 0.1448018 0.0519472 -0.0496642 0.00263 -0.0890524 -0.0948095 0.0498703 0.008619 0.0525784 0.1469137 -0.1210395 -0.0521178 -0.012546 -0.0573311 0.0811323 0.0143265 -0.0152212 0.0118263 0.1616057 0.1272623 0.0400997 0.0046732 -0.0889671 0.3552083 -0.0044146 -0.0106313 -0.0031601 0.4036846 unknown
polarizability: 252.5215056|1.3795163|135.0656997|3.6470583|-4.0663718|54.0487433 unknown
InChI: InChI=1S/C11H9NO2/c13-11(14)10-7-6-9(12-10)8-4-2-1-3-5-8/h1-7,12-13H
charge 0 multiplicity 1
23 atoms
O  3.263525 -1.888018 -0.168105
O  4.653567 -0.010642 0.013511
N  0.996517 -0.420112 -0.022694
C  -0.035871 0.507792 0.047741
C  -1.455006 0.130601 0.014404
C  0.571398 1.788117 0.162804
C  2.234582 0.228743 0.03757
C  1.981706 1.613623 0.158012
C  -2.447395 1.109305 -0.275849
C  -1.878988 -1.20572 0.266651
C  -3.812842 0.763688 -0.314297
C  -3.245298 -1.551283 0.219684
C  -4.220841 -0.569305 -0.070817
C  3.493988 -0.489188 -0.03206
H  0.909535 -1.427116 -0.156347
H  0.038631 2.731124 0.269636
H  2.749923 2.379897 0.238338
H  -2.142861 2.139266 -0.490287
H  -1.147042 -1.978698 0.531496
H  -4.55996 1.531865 -0.542192
H  -3.550332 -2.584347 0.419587
H  -5.282057 -0.837963 -0.104736
H  4.141123 -2.350329 -0.214848
