program: Gaussian 09
title: 000226205
version: EM64L-G09RevD.01
frameworkgroup: C1[X(C15H14O3)]
method: RPBEPBE
basis: SDD
operation: Freq
keyword: #pfreq=noraman
keyword: PBEPBE/SDD
title: #p freq=noraman PBEPBE/SDD
converged: YES YES NO NO
title: Mulliken charges:
elementType: O O O C C C C C C C C C C C C C C C H H H H H H H H H H H H H H
charge: -0.266666 -0.260877 -0.232164 0.168576 0.345781 0.009522 0.213458 -0.299061 -0.364434 -0.341557 0.323417 -0.367031 -0.375067 -0.362074 -0.257312 -0.224382 -0.539289 -0.536969 0.244120 0.271227 0.264499 0.241430 0.251336 0.242866 0.232072 0.227106 0.225676 0.218189 0.250372 0.225964 0.224366 0.246907
chargesum: 0.00000
title: Mulliken charges with hydrogens summed into heavy atoms:
elementType: O O O C C C C C C C C C C C C C C C
charge: -0.266666 -0.260877 -0.232164 0.168576 0.345781 0.009522 0.213458 -0.054941 -0.093207 -0.077058 0.323417 -0.125601 -0.123731 -0.119208 -0.025240 0.002724 0.154947 0.160267
polarizability: 2.70317464e+02 1.25198763e+01 1.61362642e+02 1.82152072e+01 -1.04115222e+01 1.14153928e+02
1716.lowfreq: -7.3743 -2.2163 -0.0008 -0.0005 -0.0004 5.1559 29.4205 40.9914 63.7213
frequency: 29.3482 40.9764 63.7185 80.3108 100.9359 115.6908 144.9272 153.8064 191.4283 223.3637 230.0294 254.1599 273.9722 296.5506 305.7116 351.1228 394.9064 414.6525 444.7031 478.3802 507.4745 512.6079 550.6282 578.8045 591.1696 628.1712 663.4337 680.2369 736.3952 757.2505 763.7715 777.7493 785.5168 820.5703 845.6425 855.5824 916.3115 947.0440 966.7350 975.2365 980.2776 984.2068 984.3049 1002.3347 1046.4393 1100.1932 1110.5555 1111.8739 1113.5679 1144.8073 1156.4872 1159.2102 1175.3517 1176.9264 1223.6128 1235.9990 1260.3822 1295.3027 1304.7720 1373.3797 1378.6093 1423.1494 1425.6329 1436.4385 1442.1428 1465.0553 1468.1965 1468.3831 1472.6350 1480.6451 1498.5851 1525.9480 1577.5754 1584.3935 1603.0753 1617.9344 2962.3099 2966.9598 3051.9596 3057.8581 3128.0518 3128.8665 3132.6965 3147.0956 3147.1844 3147.9252 3161.9550 3166.8988 3172.2579 3172.6007
redmass: 4.9108 4.1685 3.8262 4.1287 3.3922 5.1699 4.5726 4.6785 3.4690 1.3053 1.4423 2.9896 2.6175 4.2983 4.5401 6.9019 4.7132 2.9763 4.7421 3.9821 3.1075 3.7787 4.7489 4.9698 6.1757 7.0083 5.4239 3.7390 3.6934 1.4594 5.4303 3.1808 5.3244 1.2580 1.6847 1.6239 6.0467 1.4135 1.3831 1.3780 1.3395 8.5256 8.2354 2.5913 2.1803 2.5088 1.2592 1.2596 1.3377 1.6977 1.3353 1.4878 1.0906 1.3251 3.3576 3.2319 1.9002 1.6887 1.6625 5.9148 8.9447 1.8637 2.9547 1.1994 1.5623 1.4147 1.0509 1.0501 1.0771 1.5112 2.5045 10.9028 7.3570 7.1398 6.2645 6.4497 1.0328 1.0325 1.1041 1.1042 1.0992 1.1000 1.0860 1.0876 1.0882 1.0898 1.0937 1.0957 1.0972 1.0997
irintensity: 1.8616 0.9497 4.9855 0.4879 3.1239 6.8821 1.7835 4.0879 4.0561 0.3424 0.2048 2.2218 1.7898 2.6625 3.2417 0.9734 1.3479 0.5154 0.6848 3.1184 14.3582 9.5159 13.3122 22.4839 23.6409 1.3694 3.9053 22.2258 4.2776 94.4953 8.6499 14.4725 1.1310 2.7236 48.2840 6.3137 73.7975 6.3610 2.4980 3.3738 3.1174 47.0867 37.5670 1.7301 10.0140 23.6149 0.4744 0.1485 14.7266 14.8798 2.0727 55.7204 8.3871 124.2453 113.2473 187.8522 86.2783 172.2221 151.1238 38.3019 17.2514 49.4988 8.1396 7.7924 14.0082 78.3172 14.0706 11.9594 61.4939 6.0794 25.4394 163.7487 27.0854 34.6614 131.8626 184.2008 64.6540 74.4453 41.6321 43.6127 17.7375 24.5854 2.1768 2.9441 7.5121 6.0234 18.0631 17.5029 9.0502 19.1922
temp: 298.150 k
press: 1.00000 atm
elementType: 8 8 8 6 6 6 6 6 6 6 6 6 6 6 6 6 6 6 1 1 1 1 1 1 1 1 1 1 1 1 1 1
symmnumber: 1
zpe: 656762.0 jmol-1
zpe.correction: 0.250147 hartree
zpe.thermalcorrener: 0.266604 hartree
zpe.thermalcorrenthalpy: 0.267548 hartree
zpe.thermalcorrgfe: 0.205256 hartree
zpe.sumelectzpe: -804.351569 hartree
zpe.sumelectthermal: -804.335112 hartree
zpe.sumelectthermalent: -804.334168 hartree
zpe.sumelectthermalfe: -804.396460 hartree
dipole: 1.3068 3.9726 -0.5134
dipole: 4.2134
quadrupole: -75.1316 -102.2162 -106.9883
quadrupole: -10.2486 9.1114 6.2829
quadrupole: 19.6471 -7.4375 -12.2096 -10.2486 9.1114 6.2829
hfenergy: -804.601716 hartree
pointgroup: C01 [X(C15H14O3)]
dipole: 0.3808708 1.5268923 -0.5210492 debye
polarizability: 264.2947145|28.2254322|159.2336428|22.5660734|-16.6868463|122.305677 unknown
InChI: InChI=1S/C15H14O3/c1-17-12-9-7-11(8-10-12)15(16)13-5-3-4-6-14(13)18-2/h3-10H,1-2H3
charge 0 multiplicity 1
32 atoms
O  -1.435905 1.392206 0.463614
O  4.47525 0.954061 -0.854869
O  -0.551722 -2.312045 1.51577
C  -1.834504 -0.936273 0.032787
C  0.75518 -0.703908 0.298251
C  -0.53417 -1.348901 0.681711
C  -2.282712 0.41531 -0.078285
C  0.909823 0.057513 -0.894437
C  1.892391 -0.916296 1.120156
C  -2.699754 -1.969188 -0.405561
C  3.281642 0.375871 -0.410839
C  -3.541105 0.7093 -0.660766
C  2.158086 0.586457 -1.253221
C  3.14886 -0.378694 0.785091
C  -3.949951 -1.685714 -0.99447
C  -4.362797 -0.341454 -1.125474
C  -1.874994 2.788894 0.422142
C  5.678124 0.759265 -0.038392
H  0.047932 0.217418 -1.549859
H  1.766179 -1.517742 2.026659
H  -2.366659 -3.003507 -0.27081
H  -3.890107 1.742488 -0.744533
H  2.295648 1.161238 -2.173728
H  4.005237 -0.550434 1.443523
H  -4.593543 -2.500385 -1.340846
H  -5.332511 -0.104325 -1.577519
H  -2.817299 2.929279 0.985894
H  -2.006403 3.143098 -0.618667
H  -1.064746 3.353501 0.905752
H  5.932187 -0.314169 0.050725
H  5.554137 1.198739 0.96984
H  6.477701 1.287098 -0.578039
