program: Gaussian 09
title: 000226215
version: EM64L-G09RevD.01
frameworkgroup: C1[X(C20H12Cl2O2)]
method: RPBEPBE
basis: SDD
operation: Freq
keyword: #p
keyword: freq=noraman
keyword: PBEPBE/SDD
title: #p freq=noraman PBEPBE/SDD
converged: YES YES NO NO
title: Mulliken charges:
elementType: Cl Cl O O C C C C C C C C C C C C C C C C C C C C H H H H H H H H H H H H
charge: -0.040021 -0.055007 -0.461094 -0.210674 -0.137402 0.324924 0.320689 0.431562 0.085160 0.086853 -0.138983 -0.357939 -0.364585 -0.319993 -0.361090 -0.363408 -0.405404 -0.215313 -0.224408 -0.130840 -0.238145 -0.206948 -0.198356 -0.120491 0.283528 0.277370 0.309630 0.355152 0.287521 0.242644 0.293735 0.261666 0.235488 0.240335 0.257900 0.255942
chargesum: 0.00000
title: Mulliken charges with hydrogens summed into heavy atoms:
elementType: Cl Cl O O C C C C C C C C C C C C C C C C C C C C
charge: -0.040021 -0.055007 -0.105942 -0.210674 -0.137402 0.324924 0.320689 0.431562 0.085160 0.086853 -0.138983 -0.074411 -0.087215 -0.010363 -0.073569 -0.120764 -0.111668 0.046352 0.011079 -0.130840 0.002191 0.050952 0.057586 -0.120491
polarizability: 2.88004126e+02 -1.61987236e+01 2.62635356e+02 -3.10990333e+01 -1.49799243e+01 1.79767645e+02
1716.lowfreq: -6.1849 -5.5200 0.0016 0.0017 0.0022 11.2561 17.2739 23.1140 31.3095
frequency: 16.0962 23.0712 31.2885 49.0544 91.4854 122.4794 130.8652 140.3349 150.5494 187.9926 217.8598 246.5330 261.2446 287.6827 292.9929 322.9477 330.7372 345.5594 354.0927 369.5298 401.5420 404.1737 412.7868 414.3126 457.2957 474.9237 489.9869 504.3734 542.4360 549.6998 605.5431 624.4674 631.0173 653.2180 679.8236 680.7660 704.2365 716.2608 741.9666 764.8650 779.5215 816.7866 823.3344 833.9389 839.4505 878.6919 906.1428 914.6746 932.8980 941.7533 954.9469 969.5749 971.9741 981.5520 984.5379 999.2908 1009.1952 1039.1880 1071.2562 1072.9401 1094.9292 1106.6802 1116.0702 1143.3502 1165.5971 1173.0476 1181.4630 1185.3552 1214.4693 1256.2373 1269.0160 1281.4872 1290.0507 1300.6585 1371.0386 1381.0474 1389.3017 1395.0815 1397.9050 1439.5869 1462.0318 1471.0740 1472.8897 1549.2167 1567.3347 1585.7004 1593.1347 1596.5603 1598.7919 1613.4191 3135.4463 3136.5857 3149.4227 3154.7993 3160.3708 3160.5929 3168.2295 3171.1991 3171.7842 3175.4091 3183.7043 3561.6218
redmass: 4.8578 7.3516 8.2128 7.8902 5.2346 7.2679 5.7331 8.8632 7.1160 8.6804 6.1285 6.1572 5.9516 7.9760 6.7757 5.9133 2.6747 3.6648 5.9231 2.0744 3.6469 2.9199 6.0026 6.0303 3.7523 6.8970 7.1839 3.7383 3.5418 4.9867 5.6329 7.1573 7.0381 6.1761 6.0416 5.9879 5.0056 4.1159 3.9781 2.3949 2.8883 2.8400 1.4791 1.4425 1.3570 2.7526 1.6622 4.3654 1.5191 6.3170 1.4369 3.7342 1.7149 1.3673 1.3928 4.2562 1.3442 2.1226 2.0537 2.6665 2.1995 1.7859 1.8670 2.2211 1.8248 1.2180 2.0516 1.1915 1.7753 1.4310 3.0333 1.4854 2.0912 1.4471 5.4905 10.7704 3.6684 6.0941 6.1508 2.5026 2.6655 2.4775 2.3844 9.9527 8.0189 7.8540 7.8226 6.7198 6.8217 6.8123 1.0860 1.0895 1.0897 1.0887 1.0898 1.0945 1.0925 1.1004 1.0955 1.0971 1.0955 1.0660
irintensity: 0.0868 2.5892 0.0655 0.4623 0.7324 0.0216 0.2559 0.0135 0.9788 0.0232 0.2840 1.4283 0.6894 0.9105 2.1754 0.1407 12.9947 6.1870 1.6744 128.6724 0.7564 2.4791 4.3905 2.6031 1.6100 37.4773 29.0054 29.3818 6.6817 18.2862 9.0274 0.3143 5.0610 1.1531 20.1012 4.2181 11.0027 1.0622 4.6163 83.1461 25.3078 1.4018 54.7679 51.7839 32.6426 22.2186 3.4994 13.8506 17.1910 8.5044 1.4369 43.6886 12.2056 1.6102 1.3951 48.4190 0.3887 4.0310 5.7574 43.0595 3.4269 6.9344 13.5680 37.6008 18.5545 1.4331 7.5864 4.3385 7.5789 11.9649 182.1273 13.8668 159.0793 29.5411 10.0104 29.1799 10.2497 45.2506 19.9332 30.7096 38.1988 32.2691 62.6433 163.1152 5.1051 2.6641 21.5347 11.5594 7.6488 27.4383 2.7587 6.1097 6.0679 0.6040 1.2411 6.1095 5.1589 27.2147 1.9937 3.0412 1.5212 15.2424
temp: 298.150 k
press: 1.00000 atm
elementType: 17 17 8 8 6 6 6 6 6 6 6 6 6 6 6 6 6 6 6 6 6 6 6 6 1 1 1 1 1 1 1 1 1 1 1 1
symmnumber: 1
zpe: 676724.1 jmol-1
zpe.correction: 0.257751 hartree
zpe.thermalcorrener: 0.277386 hartree
zpe.thermalcorrenthalpy: 0.278330 hartree
zpe.thermalcorrgfe: 0.207429 hartree
zpe.sumelectzpe: -1838.280420 hartree
zpe.sumelectthermal: -1838.260785 hartree
zpe.sumelectthermalent: -1838.259840 hartree
zpe.sumelectthermalfe: -1838.330741 hartree
dipole: -1.3377 2.0145 3.0509
dipole: 3.8930
quadrupole: -169.8037 -142.2735 -147.2736
quadrupole: -7.9124 2.0349 0.0095
quadrupole: -16.6868 10.8434 5.8434 -7.9124 2.0349 0.0095
hfenergy: -1838.5381702 hartree
pointgroup: C01 [X(C20H12Cl2O2)]
dipole: -0.5006582 -0.7407839 -1.2435681 debye
polarizability: 287.2855409|15.4047513|266.944723|29.7232476|-6.1520866|176.1768627 unknown
InChI: InChI=1S/C20H12Cl2O2/c21-13-7-5-12(6-8-13)20(24)17-4-2-1-3-15(17)19(23)16-11-14(22)9-10-18(16)20/h1-11,24H
charge 0 multiplicity 1
36 atoms
Cl 4.538582 3.462594 0.53276
Cl -5.338383 2.187788 1.570957
O  -0.425588 -0.109988 -2.44304
O  2.868951 -1.536856 1.686149
C  -0.218743 -0.169392 -0.972732
C  0.999301 0.68615 -0.603659
C  -0.085965 -1.637888 -0.539738
C  -1.499438 0.437908 -0.352801
C  2.011321 0.228963 0.28144
C  0.930869 -2.081279 0.349945
C  1.993418 -1.157661 0.845958
C  1.089242 1.996773 -1.134521
C  -1.043505 -2.568085 -1.012377
C  3.096673 1.076825 0.630516
C  0.971949 -3.442506 0.758003
C  -1.576832 0.628225 1.04926
C  -2.604853 0.788608 -1.161455
C  2.163649 2.842803 -0.798378
C  -0.992422 -3.917687 -0.60962
C  3.154618 2.365232 0.089467
C  0.016903 -4.357951 0.284759
C  -2.740967 1.15907 1.642566
C  -3.778158 1.324251 -0.581294
C  -3.828206 1.49946 0.813202
H  0.307756 2.348993 -1.814322
H  -1.826371 -2.221728 -1.694019
H  3.860188 0.694012 1.313968
H  0.366208 -0.5184 -2.877498
H  1.769483 -3.74645 1.443596
H  -0.72862 0.365577 1.691533
H  -2.541956 0.64693 -2.24295
H  2.232158 3.853799 -1.210333
H  -1.738737 -4.626647 -0.984616
H  0.052101 -5.405329 0.602232
H  -2.800542 1.305685 2.724765
H  -4.633581 1.598299 -1.205621
