program: Gaussian 09
title: 000226189
version: EM64L-G09RevD.01
frameworkgroup: C1[X(C18H21Cl2NO)]
method: RPBEPBE
basis: SDD
operation: Freq
keyword: #p
keyword: freq=noraman
keyword: PBEPBE/SDD
title: #p freq=noraman PBEPBE/SDD
converged: YES YES NO NO
title: Mulliken charges:
elementType: Cl Cl O N C C C C C C C C C C C C C C C C C C H H H H H H H H H H H H H H H H H H H H H
charge: -0.037116 -0.054551 -0.281699 -0.092149 -0.343076 0.426986 0.449229 0.219299 -0.747921 -0.340117 -0.279435 -0.365289 -0.389779 -0.414289 -0.250322 -0.114454 -0.269506 -0.231335 -0.240694 -0.242873 -0.614203 -0.615712 0.261470 0.231693 0.220329 0.227881 0.279866 0.221310 0.220164 0.220216 0.214265 0.242533 0.243122 0.280880 0.225908 0.224039 0.228495 0.223784 0.194539 0.225607 0.222820 0.191901 0.228184
chargesum: 0.00000
title: Mulliken charges with hydrogens summed into heavy atoms:
elementType: Cl Cl O N C C C C C C C C C C C C C C C C C C
charge: -0.037116 -0.054551 -0.281699 -0.092149 -0.081606 0.426986 0.449229 0.219299 -0.068018 -0.060251 0.162040 0.069192 -0.147246 -0.171168 -0.250322 -0.114454 0.011373 -0.005427 -0.016655 -0.014378 0.029726 0.027193
polarizability: 2.91973700e+02 5.22161185e+00 2.17036886e+02 -1.33493942e+01 -4.00272148e+00 1.69473009e+02
1716.lowfreq: -11.6372 -4.7350 -0.0011 0.0013 0.0020 4.4613 6.7499 13.2286 19.5541
frequency: -8.3992 13.0528 19.5425 26.3894 31.3332 46.9916 74.7742 78.1293 111.6192 141.5157 163.7573 171.5376 176.6292 187.3941 203.2806 216.2951 226.9143 245.1012 250.2140 263.8351 278.6689 291.4562 341.7202 363.7680 381.1629 393.6159 402.6344 414.6810 446.7446 455.3696 470.8429 521.6576 562.6836 565.3977 582.1674 615.9310 629.4792 689.6438 705.4362 740.2873 756.7827 789.9975 793.6839 797.0577 838.0102 853.0200 853.8625 856.3838 897.0145 923.4948 930.8672 979.8962 988.3529 994.2239 997.4733 1026.7642 1033.2803 1036.4538 1040.7529 1057.9143 1059.0092 1075.0935 1084.8858 1091.9734 1104.2991 1129.9850 1139.3125 1160.5144 1173.0735 1192.2599 1202.8175 1206.1229 1235.9059 1246.2941 1268.4381 1271.1377 1290.6870 1303.9521 1327.9829 1339.8367 1354.7407 1381.3642 1382.2142 1387.0593 1395.0253 1421.8246 1430.9231 1437.5157 1443.4454 1460.0685 1468.3956 1470.5095 1475.0465 1475.7982 1480.7777 1483.3251 1484.9484 1486.4650 1558.5064 1583.2182 1591.7623 1613.7711 2857.3586 2867.0793 2905.0674 2981.0779 2996.7826 3009.5561 3020.4916 3027.9931 3041.7367 3070.7804 3078.0480 3079.7212 3082.5372 3085.7964 3117.4840 3125.0753 3138.2424 3149.0580 3158.8850 3163.5919 3184.2733
redmass: 2.5676 4.9907 4.4986 3.8059 7.8221 6.1447 2.6588 3.6737 4.2350 5.2144 5.3955 4.4931 3.6178 2.2037 1.3531 4.1712 2.5896 1.9279 2.9374 3.7065 1.1469 4.7034 2.9365 6.5085 4.3409 3.6906 2.8186 3.7306 3.1380 4.4658 3.6260 5.7469 3.9922 4.4840 4.1207 6.2143 4.1408 6.3795 1.6970 4.1732 3.2281 2.5885 4.7359 1.3119 3.4737 1.7481 2.2839 1.3202 1.4174 1.4179 8.1947 1.3879 3.9330 2.1822 1.5161 2.1921 2.1630 1.6017 1.8884 1.7003 1.7634 2.0319 2.2212 1.5110 1.7606 2.0514 1.6405 1.4418 1.0518 1.1135 1.9696 2.2760 2.4154 1.8946 2.5259 1.6786 1.2598 1.4331 1.3790 1.3074 5.2104 1.7824 3.3371 1.3973 2.7781 1.1767 2.7019 2.1809 1.1558 1.0476 1.0715 1.0777 1.0520 1.0555 1.1061 1.2424 1.6803 1.0542 8.2563 7.8066 6.0001 6.0269 1.0563 1.0569 1.0689 1.0355 1.0561 1.0828 1.0734 1.0735 1.0924 1.1067 1.0996 1.1009 1.0999 1.1008 1.0863 1.0865 1.0919 1.0952 1.0925 1.1013 1.0937
irintensity: 0.4519 0.0471 0.2736 0.0733 0.1462 0.1948 0.9848 0.5894 0.3832 0.9865 0.3324 1.1856 0.2667 1.7294 3.3378 0.1664 0.0486 2.9809 0.3607 2.0930 0.0986 4.1325 16.0708 3.8575 2.2043 1.3441 0.2600 3.7607 2.2469 5.2696 5.7424 3.7628 9.9147 8.0949 6.9895 1.0083 19.9212 41.0618 49.9940 19.2936 6.5063 49.8037 14.2297 10.1157 19.5820 26.3961 30.1690 2.4261 13.2298 3.6608 114.2818 0.0485 1.8191 3.6915 3.5743 18.8042 49.0379 28.2778 6.2708 4.3525 5.9258 19.3082 5.8561 8.9738 6.6541 81.8896 8.7957 9.1242 0.0733 1.3376 47.1351 3.0799 44.1872 4.6158 17.9501 36.7536 3.4581 6.8386 4.7129 1.4746 7.4587 6.6943 3.3475 10.8661 31.7369 10.7741 144.6382 7.7093 2.9084 12.9562 3.7516 6.9824 33.3326 1.3094 2.2213 29.0979 12.6455 10.7471 37.6034 28.7308 0.8833 9.1133 72.7635 178.4226 75.5927 21.2637 35.9806 5.7977 40.5008 49.6679 1.9752 25.8046 26.0261 51.0175 35.0400 52.5868 6.5447 0.0785 18.7660 37.4722 0.3050 23.3611 0.8671
temp: 298.150 k
press: 1.00000 atm
elementType: 17 17 8 7 6 6 6 6 6 6 6 6 6 6 6 6 6 6 6 6 6 6 1 1 1 1 1 1 1 1 1 1 1 1 1 1 1 1 1 1 1 1 1
symmnumber: 1
zpe: 904722.9 jmol-1
zpe.correction: 0.344591 hartree
zpe.thermalcorrener: 0.366757 hartree
zpe.thermalcorrenthalpy: 0.367701 hartree
zpe.thermalcorrgfe: 0.289831 hartree
zpe.sumelectzpe: -1746.941988 hartree
zpe.sumelectthermal: -1746.919822 hartree
zpe.sumelectthermalent: -1746.918878 hartree
zpe.sumelectthermalfe: -1746.996748 hartree
dipole: 1.4123 -2.0463 0.8039
dipole: 2.6130
quadrupole: -130.9294 -148.5409 -143.4159
quadrupole: 3.6061 -0.6077 -0.4566
quadrupole: 10.0326 -7.5788 -2.4538 3.6061 -0.6077 -0.4566
hfenergy: -1747.2865789 hartree
pointgroup: C01 [X(C18H21Cl2N1O1)]
dipole: 0.5241314 -0.7961728 0.385056 debye
polarizability: 291.9752771|0.6014952|215.706457|-14.954401|-7.6692038|170.8018617 unknown
InChI: InChI=1S/C18H21Cl2NO/c1-13(14-7-5-4-6-8-14)16-11-15(19)12-17(20)18(16)22-10-9-21(2)3/h4-8,11-13H,9-10H2,1-3H3
charge 0 multiplicity 1
43 atoms
Cl 2.598121 2.416616 -1.41469
Cl -2.371611 4.221949 0.265616
O  1.536241 -0.320828 -0.493478
N  5.005009 -1.356538 0.492304
C  -1.011588 -0.932469 0.735137
C  -0.636872 0.486808 0.28233
C  -2.398327 -1.338957 0.212255
C  0.653461 0.748076 -0.262627
C  -0.852701 -1.048765 2.273635
C  -1.555534 1.554721 0.430786
C  2.714837 -0.422883 0.418358
C  3.77651 -1.242507 -0.326869
C  -2.577449 -1.501162 -1.188343
C  -3.511298 -1.557977 1.061128
C  0.978854 2.073722 -0.648786
C  -1.182822 2.855169 0.055412
C  0.081771 3.145074 -0.492652
C  -3.827942 -1.872017 -1.724469
C  -4.768734 -1.928838 0.527297
C  -4.933104 -2.086826 -0.866071
C  5.881057 -0.170378 0.391398
C  5.74706 -2.612845 0.267468
H  -0.267793 -1.60968 0.273957
H  -1.082202 -2.073848 2.616585
H  -1.515738 -0.34425 2.808197
H  0.184581 -0.812826 2.570342
H  -2.556516 1.356322 0.825372
H  3.082499 0.589698 0.665157
H  2.407762 -0.936898 1.348538
H  3.37154 -2.253954 -0.510788
H  3.957745 -0.774239 -1.323514
H  -1.725428 -1.333288 -1.859146
H  -3.405698 -1.449921 2.145824
H  0.353558 4.157131 -0.80085
H  -3.942827 -1.994163 -2.807523
H  -5.617038 -2.095029 1.201239
H  -5.906264 -2.374624 -1.279332
H  5.31406 0.749127 0.616913
H  6.336686 -0.050597 -0.624026
H  6.699489 -0.250827 1.128884
H  6.586476 -2.678164 0.983364
H  6.170842 -2.703498 -0.764656
H  5.083425 -3.477616 0.443626
