program: Gaussian 09
title: 000226196
version: EM64L-G09RevD.01
frameworkgroup: C1[X(C22H22N2O)]
method: RPBEPBE
basis: SDD
operation: Freq
keyword: #p
keyword: freq=noraman
keyword: PBEPBE/SDD
title: #p freq=noraman PBEPBE/SDD
converged: YES YES NO NO
title: Mulliken charges:
elementType: O N N C C C C C C C C C C C C C C C C C C C C C C H H H H H H H H H H H H H H H H H H H H H H
charge: -0.282056 -0.445310 -0.154662 -0.568001 0.499955 0.499992 0.203279 -0.427097 -0.353099 -0.354938 -0.427768 0.498365 0.418350 -0.496079 -0.363493 -0.227203 -0.236797 -0.236443 -0.227086 -0.334235 -0.349598 -0.245479 -0.245480 -0.647125 -0.646996 0.181681 0.300190 0.216548 0.269725 0.270423 0.216525 0.213117 0.301978 0.222436 0.223610 0.223637 0.222406 0.236389 0.236742 0.226422 0.226389 0.216759 0.230817 0.230837 0.233628 0.233600 0.215146
chargesum: 0.00000
title: Mulliken charges with hydrogens summed into heavy atoms:
elementType: O N N C C C C C C C C C C C C C C C C C C C C C C
charge: -0.282056 -0.145121 -0.154662 -0.386320 0.499955 0.499992 0.203279 -0.210550 -0.083374 -0.084514 -0.211243 0.498365 0.418350 -0.282961 -0.061515 -0.004766 -0.013187 -0.012806 -0.004680 -0.097846 -0.112856 -0.019058 -0.019091 0.031288 0.035377
polarizability: 3.60707111e+02 -4.90263932e-02 2.16619561e+02 3.70524498e+00 -7.56806052e-02 2.37958203e+02
1716.lowfreq: -18.7669 -8.3472 -6.0646 -1.8995 -0.0007 0.0004 0.0006 11.0750 21.8791
frequency: -18.7553 11.0063 21.8381 35.9099 48.3517 53.5716 62.9699 74.5024 92.3300 123.1853 144.5227 146.4626 181.8954 201.4430 204.1229 232.0738 241.8059 251.7236 275.1482 325.5259 345.7762 383.9990 386.9093 400.3848 406.0433 417.7252 473.6550 473.7421 478.5027 520.8701 533.4513 549.7581 614.8511 615.1149 621.8216 633.3720 634.6486 691.9493 700.3898 700.4731 707.9666 723.1927 751.2459 754.3340 794.8741 796.2524 805.1393 827.5834 847.1329 854.6346 854.8813 865.2582 916.2450 920.8729 920.9608 943.3265 956.4307 972.4466 975.7886 977.5376 989.0030 991.2743 993.4498 994.9056 997.3321 1028.1129 1028.7132 1054.7214 1076.3910 1089.2599 1108.5386 1110.0625 1135.5315 1151.9586 1167.0791 1170.7096 1171.3180 1179.4767 1187.0123 1190.2201 1193.8622 1203.9178 1229.4363 1260.7937 1265.4910 1291.6831 1322.6138 1333.1091 1347.2378 1359.0346 1378.9563 1381.8287 1385.6931 1423.2294 1438.1437 1439.2354 1442.0759 1457.3111 1462.3225 1473.3177 1476.5029 1480.0228 1490.3936 1502.6622 1507.5747 1526.0790 1580.0543 1590.7574 1591.4954 1605.6802 1606.0631 1612.9231 1641.3337 2931.0070 2940.7633 2985.0090 2993.2782 2999.1459 3091.3636 3102.0875 3105.0528 3108.3892 3110.4539 3124.9967 3125.5555 3138.2996 3139.0317 3154.7196 3156.9362 3160.9674 3166.0674 3168.6243 3170.0952 3194.8285 3531.7949
redmass: 3.6753 5.2373 3.4475 4.2496 4.4869 4.5212 4.9073 2.4827 2.3876 4.4344 2.3658 4.4973 5.6098 3.7748 1.1146 4.0633 2.5307 4.5398 4.3407 7.4787 4.9659 4.2548 4.7963 2.8101 2.8803 3.0549 3.4939 3.6581 3.6259 2.4320 3.5869 5.1123 6.4598 6.3598 4.6374 7.0178 1.1837 5.3274 2.1863 4.0383 1.6781 3.5314 2.9358 1.8672 3.5749 1.3916 5.1495 1.5996 1.2785 1.3207 3.3222 4.3490 1.4518 1.4279 1.7915 3.0951 3.4705 1.4003 1.3080 1.3988 5.1470 4.9978 1.3622 2.9605 1.3623 2.1884 2.3030 1.4893 1.6291 1.6045 1.3010 1.2546 1.4383 2.2477 1.6494 1.0775 1.1800 2.3449 1.3861 1.5471 1.1150 1.1394 1.6314 2.0067 2.8964 1.5606 1.5313 1.2567 1.4115 3.1940 6.0377 6.8714 6.1164 1.6913 1.8003 2.1307 2.1864 1.2172 1.0405 1.0464 2.2086 2.1834 1.2555 1.6427 1.1668 2.6511 5.6214 5.9754 6.4493 4.3727 6.0788 5.8353 6.2554 1.0370 1.0394 1.0838 1.1000 1.1019 1.0958 1.0936 1.0897 1.0875 1.0873 1.0864 1.0867 1.0925 1.0928 1.0962 1.0974 1.0888 1.0995 1.0923 1.0974 1.0949 1.0761
irintensity: 0.2520 1.3384 0.1343 0.0236 0.0613 0.1400 0.5452 0.3401 9.5216 6.3661 0.2609 4.8476 0.2381 2.6758 0.0035 3.9165 2.4381 0.2597 0.2078 4.9006 0.2696 8.0444 4.7434 0.0414 0.3173 0.0093 3.5816 2.8437 0.9914 32.8949 34.9278 1.7199 0.3490 0.0987 22.4649 2.3396 46.3994 1.8455 26.4650 5.5760 88.6809 0.0008 33.5822 30.1512 0.9399 34.6164 10.1390 72.5827 0.1614 1.6589 1.6366 4.6287 1.0686 1.9421 1.0470 36.1669 7.2100 0.0351 3.4175 2.4785 0.1751 0.0364 0.0080 0.0295 3.4629 15.7921 12.7314 25.9781 1.3015 21.0604 0.7899 0.2131 20.5616 116.3473 2.7288 0.0406 2.3560 0.9164 0.0588 2.7015 7.4945 6.1240 3.5915 27.1796 36.9702 30.1133 74.3968 4.1005 21.1765 167.7428 24.1319 0.1364 2.8620 22.5430 16.6266 0.5283 17.0658 35.3347 0.0015 21.2359 42.5821 106.0899 85.0744 193.5261 1.5334 477.1073 79.4634 0.2503 33.5312 94.9230 19.1699 37.8720 102.9953 124.3106 119.2324 25.9149 29.2425 69.3670 4.7699 56.0192 16.4739 9.8944 11.6274 0.8335 0.9970 3.3568 61.5473 31.2933 23.3329 14.4441 20.0915 17.8628 13.8424 6.7064 11.7607
temp: 298.150 k
press: 1.00000 atm
elementType: 8 7 7 6 6 6 6 6 6 6 6 6 6 6 6 6 6 6 6 6 6 6 6 6 6 1 1 1 1 1 1 1 1 1 1 1 1 1 1 1 1 1 1 1 1 1 1
symmnumber: 1
zpe: 1006013.4 jmol-1
zpe.correction: 0.383170 hartree
zpe.thermalcorrener: 0.405151 hartree
zpe.thermalcorrenthalpy: 0.406095 hartree
zpe.thermalcorrgfe: 0.329046 hartree
zpe.sumelectzpe: -1034.504814 hartree
zpe.sumelectthermal: -1034.482833 hartree
zpe.sumelectthermalent: -1034.481889 hartree
zpe.sumelectthermalfe: -1034.558938 hartree
dipole: 3.6947 -0.0042 -2.7441
dipole: 4.6023
quadrupole: -112.3354 -147.4884 -131.2778
quadrupole: 0.0909 3.4058 -0.0298
quadrupole: 18.0318 -17.1213 -0.9106 0.0909 3.4058 -0.0298
hfenergy: -1034.8879841 hartree
pointgroup: C01 [X(C22H22N2O1)]
dipole: 1.4672537 -0.0690144 1.0587403 debye
polarizability: 360.1687459|-7.6497287|217.0272226|-5.4432714|0.3681323|238.0889061 unknown
InChI: InChI=1S/C22H22N2O/c1-24(2)20-15-13-19(14-16-20)23-22(25)21(17-9-5-3-6-10-17)18-11-7-4-8-12-18/h3-16,21,23H,1-2H3
charge 0 multiplicity 1
47 atoms
O  -0.261276 0.039196 -1.420541
N  0.704843 0.012077 0.713736
N  6.316542 -0.296129 -0.270716
C  -1.750379 0.13926 0.556712
C  -2.479945 1.457757 0.232565
C  -2.617925 -1.097694 0.251533
C  -0.376292 0.0589 -0.154296
C  -3.060608 2.198049 1.29353
C  -2.817069 -1.574346 -1.069521
C  -2.618716 1.940278 -1.094051
C  -3.263802 -1.764224 1.323545
C  2.099427 -0.063966 0.407545
C  4.935851 -0.21865 -0.04628
C  3.011905 -0.101596 1.492839
C  2.615317 -0.103155 -0.913867
C  -3.771128 3.393097 1.040473
C  -3.645595 -2.693453 -1.305689
C  -3.324221 3.137517 -1.346485
C  -4.096838 -2.881008 1.086797
C  4.398431 -0.177316 1.279587
C  4.003006 -0.178534 -1.130087
C  -3.906264 3.86737 -0.283941
C  -4.291652 -3.349701 -0.232142
C  7.242072 -0.340756 0.865397
C  6.833843 -0.341051 -1.642528
H  -1.578869 0.138127 1.651293
H  0.484218 0.034216 1.711672
H  -2.962815 1.835248 2.325007
H  -2.300732 -1.082791 -1.899595
H  -2.151323 1.389621 -1.916025
H  -3.120457 -1.404743 2.350852
H  2.636106 -0.071837 2.524709
H  1.923177 -0.07449 -1.757136
H  -4.21496 3.950971 1.872971
H  -3.786394 -3.054409 -2.330965
H  -3.419277 3.501532 -2.375919
H  -4.589137 -3.382825 1.927687
H  5.060655 -0.203728 2.148977
H  4.359778 -0.205948 -2.163411
H  -4.455776 4.79398 -0.484867
H  -4.936103 -4.21581 -0.42053
H  8.277108 -0.403597 0.493796
H  7.060331 -1.223371 1.513599
H  7.164615 0.567127 1.499351
H  6.558802 0.566526 -2.218787
H  6.454784 -1.223058 -2.199154
H  7.933341 -0.404563 -1.618344
