program: Gaussian 09
title: 000226221
version: EM64L-G09RevD.01
frameworkgroup: C1[X(C22H22O4)]
method: RPBEPBE
basis: SDD
operation: Freq
keyword: #pfreq=noraman
keyword: PBEPBE/SDD
title: #p freq=noraman PBEPBE/SDD
converged: YES YES NO NO
title: Mulliken charges:
elementType: O O O O C C C C C C C C C C C C C C C C C C C C C C H H H H H H H H H H H H H H H H H H H H H H
charge: -0.440483 -0.440657 -0.264128 -0.264129 0.286515 0.286256 -0.407014 -0.406825 0.368783 0.368619 -0.413078 -0.413122 -0.249088 -0.249072 -0.355961 -0.356079 -0.366463 -0.366350 -0.374586 -0.374565 -0.361626 -0.361557 0.319217 0.319179 -0.538075 -0.538059 0.264126 0.263953 0.266413 0.266743 0.225029 0.225044 0.247170 0.247141 0.260845 0.260842 0.343414 0.343502 0.254198 0.254212 0.242652 0.242662 0.221455 0.224118 0.246621 0.224130 0.246631 0.221452
chargesum: 0.00000
title: Mulliken charges with hydrogens summed into heavy atoms:
elementType: O O O O C C C C C C C C C C C C C C C C C C C C C C
charge: -0.097069 -0.097155 -0.264128 -0.264129 0.286515 0.286256 -0.142888 -0.142872 0.368783 0.368619 -0.146665 -0.146379 -0.024059 -0.024028 -0.108792 -0.108939 -0.105617 -0.105508 -0.120388 -0.120353 -0.118975 -0.118896 0.319217 0.319179 0.154118 0.154153
polarizability: 2.83091038e+02 -3.46987668e-02 2.87113649e+02 -2.98021989e+01 -3.01142919e-03 1.85872815e+02
1716.lowfreq: -4.2685 -2.1464 0.0007 0.0008 0.0010 3.1438 14.9247 23.1712 32.9371
frequency: 14.9245 23.1662 32.9048 35.5443 45.0266 50.0671 80.7955 88.6976 115.6251 124.1235 138.0124 139.8763 175.4876 205.0393 219.1729 221.3902 234.6296 243.2732 249.6927 254.9523 256.3794 271.1839 287.5541 287.9316 340.8227 382.4688 412.6273 412.9838 419.2220 432.0979 455.3322 456.9793 490.1259 499.1600 539.6174 547.7172 562.9134 564.6810 619.3499 625.0328 634.0987 659.2628 698.7701 715.2558 734.1020 741.0241 762.0628 771.8899 805.5859 815.1715 819.3884 820.4538 834.7326 835.6791 849.0822 856.5663 902.5956 930.8461 934.4122 952.4334 954.2795 966.9432 970.1092 970.9516 986.6368 986.7639 996.0165 1002.5568 1003.0542 1049.0147 1084.7028 1111.4001 1111.5610 1112.4439 1112.4696 1156.8579 1156.9611 1168.7308 1169.1640 1175.1693 1180.4996 1186.6542 1189.7889 1192.6615 1207.8023 1220.9312 1231.5129 1233.2573 1267.9519 1283.9862 1285.4055 1312.2752 1313.2648 1338.7569 1350.6974 1376.4020 1384.6572 1387.8551 1419.6426 1420.6357 1434.6641 1436.2911 1436.5446 1466.3099 1467.5640 1467.5783 1472.8142 1473.0151 1499.0979 1499.5273 1579.4041 1579.7384 1581.9954 1611.8162 1619.4849 1619.5897 2960.8588 2960.9666 3025.4492 3028.0614 3049.5015 3049.5566 3123.9742 3126.6614 3126.7006 3130.2391 3130.8849 3131.8026 3132.5138 3142.2805 3158.0811 3163.2915 3163.4195 3166.5733 3167.6217 3167.7901 3546.1553 3546.4404
redmass: 6.0538 3.7688 4.9199 3.7647 4.8234 5.0392 3.8468 3.9023 4.6524 4.5456 4.0033 5.2543 4.4272 2.2182 1.6683 1.4007 3.2627 1.1680 2.9872 1.8756 2.4141 2.6499 3.7229 3.8003 6.4127 5.7859 3.1801 2.9754 4.8743 3.7633 4.2063 4.3119 4.0690 3.9567 4.8413 3.2701 2.9948 3.4902 5.9558 6.5207 6.6419 5.8809 4.3207 3.1208 3.9845 3.0330 4.9197 1.9982 2.6286 2.7183 1.3210 1.5292 1.7198 2.1052 2.5833 4.0527 1.4418 4.5814 4.3753 1.4695 1.5008 1.3571 1.3742 1.3466 8.5952 8.5275 1.3200 2.7029 2.6928 2.1544 2.4588 1.3574 1.3531 1.2673 1.2679 1.3636 1.3560 1.1524 1.8635 1.4352 1.3820 1.4742 1.7804 1.6839 1.2983 1.6881 3.2896 3.4869 1.6686 1.5876 1.6610 1.3862 1.3839 1.4362 1.1938 3.4974 3.9287 4.3734 3.4302 3.3497 1.9518 1.1698 1.2671 2.7088 1.0507 1.0505 1.0792 1.0772 2.4084 2.4232 6.8379 7.0350 6.6844 6.5111 6.2450 6.2657 1.0329 1.0329 1.0839 1.0838 1.1040 1.1040 1.0853 1.0991 1.0991 1.0896 1.0894 1.0894 1.0893 1.0906 1.0926 1.0937 1.0937 1.0984 1.0956 1.0956 1.0664 1.0664
irintensity: 0.2785 2.7912 0.3220 0.0388 1.0204 0.2976 1.9124 1.6988 0.5051 10.8056 1.6991 1.3309 2.8703 8.3138 7.3036 37.4209 37.4525 187.0798 1.5124 6.0446 10.7178 4.8128 0.0351 2.7372 0.9258 2.1096 0.0725 0.0195 0.0429 3.1099 0.3829 1.2005 1.5769 5.7420 19.2180 2.3647 85.3771 19.6745 0.6221 5.0819 0.2500 1.6379 5.2713 13.2547 1.6236 40.4192 4.0718 48.5815 61.2008 1.0299 8.8616 0.2501 109.4813 2.9877 7.3019 14.4938 0.0513 142.9699 1.2892 23.6483 0.0353 1.3008 4.5547 0.1900 87.0033 0.9104 0.2659 12.3442 1.2238 6.8423 20.8028 9.9916 8.0268 0.9633 1.2126 0.2047 0.3507 2.2768 81.3494 31.4081 83.0011 1.2850 12.4185 37.9322 26.0366 2.8373 316.9168 63.4575 11.3575 34.6555 39.2559 9.6227 1.8065 6.8335 89.3917 3.5578 5.0992 4.9466 3.7076 6.8539 12.7295 17.7626 3.2810 14.3377 10.7123 17.0432 91.5383 21.6587 147.3294 45.2220 11.6634 10.7926 11.5546 1.6602 125.4360 23.8588 123.7070 8.6337 16.0640 3.4396 29.0778 62.5055 3.9758 24.0369 33.9311 7.0568 4.5287 14.0839 0.1256 16.9048 9.4352 15.9966 8.9962 34.9399 1.8778 5.1833 15.1594 2.0534
temp: 298.150 k
press: 1.00000 atm
elementType: 8 8 8 8 6 6 6 6 6 6 6 6 6 6 6 6 6 6 6 6 6 6 6 6 6 6 1 1 1 1 1 1 1 1 1 1 1 1 1 1 1 1 1 1 1 1 1 1
symmnumber: 1
zpe: 1005489.3 jmol-1
zpe.correction: 0.382971 hartree
zpe.thermalcorrener: 0.407693 hartree
zpe.thermalcorrenthalpy: 0.408637 hartree
zpe.thermalcorrgfe: 0.326344 hartree
zpe.sumelectzpe: -1150.521473 hartree
zpe.sumelectthermal: -1150.496751 hartree
zpe.sumelectthermalent: -1150.495806 hartree
zpe.sumelectthermalfe: -1150.578100 hartree
dipole: 0.0011 0.7738 -0.0029
dipole: 0.7738
quadrupole: -108.6995 -149.9120 -161.0531
quadrupole: -0.0193 -5.1832 -0.0188
quadrupole: 31.1887 -10.0238 -21.1649 -0.0193 -5.1832 -0.0188
hfenergy: -1150.9044435 hartree
pointgroup: C01 [X(C22H22O4)]
dipole: 0.000373 -0.304413 0.0033945 debye
polarizability: 284.663695|0.2360031|287.1078185|27.0694294|-0.773177|184.3059887 unknown
InChI: InChI=1S/C22H22O4/c1-25-17-11-7-15(8-12-17)21(23)19-5-3-4-6-20(19)22(24)16-9-13-18(26-2)14-10-16/h3-14,21-24H,1-2H3
charge 0 multiplicity 1
48 atoms
O  -0.591503 -0.845578 2.924582
O  0.591348 -0.895507 -2.902576
O  -4.914863 2.621415 -0.195805
O  4.910606 2.622959 0.166786
C  -0.203378 -1.937411 0.706039
C  0.199734 -1.949315 -0.666292
C  -0.439837 -0.620288 1.461225
C  0.437801 -0.645271 -1.443426
C  -1.625874 0.196771 0.949442
C  1.623234 0.18004 -0.943817
C  -0.380703 -3.16736 1.380896
C  0.375269 -3.190597 -1.320514
C  -0.190195 -4.40246 0.720868
C  0.182772 -4.414204 -0.639942
C  -1.617811 1.611524 1.094673
C  1.614979 1.592356 -1.110963
C  -2.778029 -0.415867 0.40092
C  2.775093 -0.423756 -0.384945
C  -2.721578 2.388196 0.706628
C  2.718235 2.375246 -0.734029
C  -3.899841 0.348822 0.007153
C  3.896401 0.347206 -0.002212
C  -3.870322 1.757194 0.161282
C  3.866663 1.753054 -0.17801
C  -6.123602 2.023984 -0.769894
C  6.118904 2.034968 0.751449
H  0.474904 -0.003898 1.399201
H  -0.476815 -0.027603 -1.393123
H  -0.642011 -3.142082 2.443053
H  0.636751 -3.183025 -2.38288
H  -0.332164 -5.34247 1.266213
H  0.323217 -5.363459 -1.169438
H  -0.734244 2.100214 1.522342
H  0.731575 2.074173 -1.546694
H  -2.796647 -1.503183 0.262425
H  2.793816 -1.508768 -0.229416
H  -1.558194 -0.952182 3.119203
H  1.558447 -1.003057 -3.094575
H  -2.722361 3.477246 0.812038
H  2.718775 3.462544 -0.856181
H  -4.772229 -0.155657 -0.418716
H  4.768569 -0.150436 0.432026
H  -6.606992 1.328919 -0.056023
H  -5.899564 1.490587 -1.714035
H  -6.793603 2.872049 -0.973054
H  5.89395 1.515855 1.703307
H  6.788182 2.886399 0.942559
H  6.603631 1.329416 0.048851
