program: Gaussian 09
title: 000226179
version: EM64L-G09RevD.01
frameworkgroup: C1[X(C21H26N2O4)]
method: RPBEPBE
basis: SDD
operation: Freq
keyword: #p
keyword: freq=noraman
keyword: PBEPBE/SDD
title: #p freq=noraman PBEPBE/SDD
converged: NO YES NO NO
title: Mulliken charges:
elementType: O O O O N N C C C C C C C C C C C C C C C C C C C C C H H H H H H H H H H H H H H H H H H H H H H H H H H
charge: -0.287803 -0.287465 -0.291282 -0.291627 -0.167267 -0.475180 -0.401061 -0.395470 -0.381359 -0.401484 -0.382666 0.487319 -0.376689 -0.375907 -0.370194 -0.484844 0.493626 0.109965 0.358658 -0.548858 -0.516635 0.234399 0.294151 0.058762 -0.499579 -0.532959 -0.521761 0.191497 0.219829 0.198599 0.205983 0.205141 0.196267 0.225688 0.194155 0.200221 0.212504 0.234054 0.219824 0.305209 0.215496 0.314905 0.289057 0.231220 0.226899 0.204824 0.254060 0.229757 0.239994 0.233959 0.269596 0.204800 0.229672
chargesum: 0.00000
title: Mulliken charges with hydrogens summed into heavy atoms:
elementType: O O O O N N C C C C C C C C C C C C C C C C C C C C C
charge: -0.287803 -0.287465 -0.291282 -0.291627 -0.167267 -0.160275 0.010265 0.009112 0.020048 0.018360 0.030059 0.487319 -0.142635 -0.156082 -0.064985 -0.269348 0.493626 0.109965 0.358658 -0.259800 -0.285415 0.234399 0.294151 0.058762 0.186204 0.170751 0.182307
polarizability: 5.23725552e+02 4.24036907e+00 2.63280898e+02 -3.30908929e+00 -6.48963301e+00 1.45196880e+02
1716.lowfreq: -21.6747 -5.0579 -0.0004 0.0005 0.0015 3.5410 7.8169 14.8717 32.7772
frequency: -16.5728 14.2136 32.7093 43.9521 47.5639 49.8588 70.6476 79.6324 93.0832 102.1289 113.3096 130.9143 138.4555 156.4581 171.1357 183.9955 198.5898 208.1658 220.5791 226.2801 237.2741 250.2572 272.4329 293.3084 305.2405 320.3042 337.4954 361.8608 366.8333 380.9799 394.5049 411.6870 432.6952 440.0674 449.8601 464.0476 487.0944 524.1859 533.5821 559.9688 577.5025 586.8634 627.0169 633.6341 661.0563 670.8477 706.5791 721.8175 730.9336 747.9941 777.7515 798.6504 803.6910 828.7172 839.7932 841.7353 848.8959 853.0565 868.4445 888.8746 914.2078 917.4523 922.2793 929.8618 948.2333 949.9711 977.6192 994.9986 1004.2351 1020.6879 1063.0876 1071.4864 1084.4875 1095.9493 1107.7213 1109.9685 1113.0713 1126.9383 1128.4052 1131.9309 1147.1965 1153.4494 1153.7018 1158.9474 1177.7304 1200.8993 1215.0273 1228.3759 1229.5089 1238.2774 1264.1581 1264.5961 1272.2519 1305.2855 1319.1778 1331.9866 1341.0770 1346.8726 1352.7712 1353.9837 1368.8705 1379.3305 1383.8374 1401.0932 1418.5906 1427.6173 1439.1749 1444.1267 1450.9786 1452.0828 1453.1950 1461.3706 1463.6698 1465.5908 1467.2109 1468.5553 1472.3191 1479.0247 1480.3594 1484.2960 1504.6869 1513.2580 1562.8138 1582.1093 1596.6294 1602.3054 1633.4413 2872.8463 2880.0054 2968.4935 2968.7665 2970.5757 2976.2910 2985.5514 2986.5007 3036.8764 3045.2424 3051.9951 3056.3904 3062.4942 3083.4119 3087.4017 3087.8931 3104.8066 3125.6208 3126.5303 3128.0990 3143.2018 3152.8052 3158.4172 3173.4103 3192.1231 3534.2312
redmass: 3.2650 4.7331 4.7033 4.7889 3.3947 3.4653 3.8089 4.3230 3.7567 1.9602 4.4121 4.7883 3.3362 1.5584 2.0524 1.8777 2.9941 2.5118 1.9544 2.4772 3.6733 2.8980 1.7492 3.9391 4.7943 6.1879 3.7673 2.1508 4.7300 4.9499 4.7718 3.1265 3.7295 3.3631 4.4038 4.1687 2.7801 3.4190 3.5662 4.5714 3.7340 3.7788 1.8988 3.0794 3.3538 4.2121 4.4990 3.7855 4.4131 4.0929 5.9992 1.5030 1.4265 1.6872 3.1953 2.7685 1.4401 2.1123 6.8208 1.6209 2.6408 5.2655 3.1066 1.4688 9.0471 1.3157 1.3106 3.2318 5.6591 2.5110 1.9127 5.2286 1.4121 2.2427 1.2449 1.2394 1.2596 2.1369 2.6781 1.3413 1.4884 1.3088 1.3894 1.5844 3.3178 1.1732 1.9871 1.6155 2.0152 1.5413 1.8506 1.2761 1.1741 4.4708 1.5568 1.2979 1.5573 1.8797 1.5492 1.6448 2.0546 3.0238 2.6811 3.2584 1.2676 3.3598 1.2702 1.3036 1.0970 1.1497 1.1052 1.0888 1.0986 1.0625 1.4904 1.1436 1.0613 1.1030 1.3471 1.0663 2.5210 2.7792 8.0247 4.5564 6.3845 5.6094 6.2807 1.0710 1.0724 1.0631 1.0357 1.0327 1.0351 1.0615 1.0605 1.0963 1.1011 1.0948 1.0991 1.1044 1.0949 1.0877 1.0961 1.0891 1.1056 1.1009 1.1050 1.0910 1.0928 1.0891 1.0906 1.0948 1.0756
irintensity: 0.2496 1.6272 1.0646 1.3978 0.4854 6.0724 5.9423 2.8830 0.9771 2.9868 5.5691 5.5240 6.3865 2.1362 2.5564 4.9626 2.5954 2.8668 1.5314 1.2147 0.6705 16.1530 0.8672 3.8747 1.7144 3.0573 3.9380 12.3963 4.4489 5.2950 9.4277 3.2966 4.9060 4.6574 1.1403 15.0870 1.0785 17.1802 15.7569 11.1653 13.5191 18.8626 14.5001 13.6330 15.9365 12.5251 14.4590 2.1174 31.7609 17.0450 5.9669 19.5587 10.4924 56.6678 6.3742 4.8608 36.7337 10.1282 32.1258 30.4615 32.4632 4.7984 31.3152 2.8669 65.7265 3.4372 5.9572 1.3474 53.4684 11.2545 5.0955 234.9164 5.9847 15.3439 6.3058 19.6817 0.2098 66.2918 18.7616 11.4640 14.9483 14.5387 28.0947 54.0028 76.3831 3.7953 14.8533 16.3321 52.5510 295.4964 31.1025 2.7243 14.7768 235.2861 115.3346 3.7802 36.2679 50.8141 6.4964 45.3056 102.6673 57.8216 3.1865 57.2668 21.1083 80.2204 10.4857 18.4028 12.4616 38.4575 6.6130 17.3736 64.3257 20.7024 170.9635 60.9448 35.8712 30.3623 64.5555 10.5033 138.6200 484.2345 303.7167 37.6342 7.8609 12.6382 98.4407 50.6520 164.1263 54.3972 86.1286 52.9834 96.7910 35.7642 41.0000 93.0054 40.8696 14.2635 85.5090 37.4405 38.6832 21.9934 49.5890 21.0955 18.2213 26.2434 16.5830 7.3825 23.4408 17.5236 5.9404 8.0386 8.6796
temp: 298.150 k
press: 1.00000 atm
elementType: 8 8 8 8 7 7 6 6 6 6 6 6 6 6 6 6 6 6 6 6 6 6 6 6 6 6 6 1 1 1 1 1 1 1 1 1 1 1 1 1 1 1 1 1 1 1 1 1 1 1 1 1 1
symmnumber: 1
zpe: 1140062.7 jmol-1
zpe.correction: 0.434227 hartree
zpe.thermalcorrener: 0.460136 hartree
zpe.thermalcorrenthalpy: 0.461080 hartree
zpe.thermalcorrgfe: 0.377016 hartree
zpe.sumelectzpe: -1224.184293 hartree
zpe.sumelectthermal: -1224.158384 hartree
zpe.sumelectthermalent: -1224.157440 hartree
zpe.sumelectthermalfe: -1224.241504 hartree
dipole: 0.1959 0.8052 0.6193
dipole: 1.0345
quadrupole: -105.3691 -146.7239 -164.0964
quadrupole: 4.9643 -13.2740 2.5020
quadrupole: 33.3607 -7.9941 -25.3666 4.9643 -13.2740 2.5020
hfenergy: -1224.6185197 hartree
pointgroup: C01 [X(C21H26N2O4)]
dipole: 0.0615877 0.3899361 -0.0990103 debye
polarizability: 522.9590762|17.0524691|184.1330307|4.506292|-55.4125146|225.111223 unknown
InChI: InChI=1S/C21H26N2O4/c1-25-18-13-15(14-19(26-2)20(18)27-3)21(24)22-16-7-9-17(10-8-16)23-11-5-4-6-12-23/h7-10,13-14,22H,4-6,11-12H2,1-3H3
charge 0 multiplicity 1
53 atoms
O  -0.629586 -1.175453 1.622121
O  -4.448121 1.326939 -2.359566
O  -5.68341 -1.958585 1.072263
O  -6.470346 -0.336463 -1.058072
N  5.716356 0.165462 -0.053854
N  0.013329 -0.177328 -0.402627
C  8.657475 0.231443 0.099379
C  7.769127 0.54157 1.322868
C  7.904761 0.614388 -1.19321
C  6.39415 -0.15427 1.220166
C  6.542168 -0.105518 -1.257849
C  4.305345 0.031395 -0.132387
C  3.531831 -0.509095 0.939017
C  3.585482 0.480657 -1.28285
C  2.12645 -0.586803 0.88564
C  2.1861 0.394072 -1.345773
C  1.430599 -0.134997 -0.264335
C  -0.933497 -0.638763 0.506123
C  -2.371608 -0.488259 0.077721
C  -3.323554 -1.255957 0.792896
C  -2.805066 0.370136 -0.954839
C  -4.177887 0.458791 -1.294495
C  -4.686125 -1.188212 0.451908
C  -5.140336 -0.331967 -0.603035
C  -5.758116 1.992088 -2.478708
C  -5.25295 -2.914417 2.099234
C  -7.529831 -0.010957 -0.07706
H  8.898954 -0.851725 0.078627
H  9.617822 0.775778 0.168766
H  8.261975 0.218669 2.259905
H  7.609363 1.635428 1.39002
H  7.739131 1.709091 -1.215385
H  8.497916 0.344955 -2.088215
H  5.759582 0.1924 2.053602
H  6.526959 -1.258471 1.33671
H  6.719341 -1.205102 -1.351924
H  5.993665 0.208728 -2.158888
H  4.025922 -0.902771 1.831481
H  4.117088 0.933525 -2.125292
H  1.559475 -1.010087 1.716604
H  1.670954 0.760482 -2.244145
H  -0.343925 0.15513 -1.300502
H  -2.949919 -1.891348 1.599953
H  -2.133093 1.043691 -1.497089
H  -5.59776 2.775924 -3.235723
H  -6.056315 2.455779 -1.518528
H  -6.534837 1.283454 -2.803978
H  -4.790083 -2.397238 2.960952
H  -6.174093 -3.423823 2.418429
H  -4.540326 -3.650638 1.682276
H  -7.545098 -0.75294 0.736634
H  -7.373785 1.005524 0.335657
H  -8.468555 -0.044509 -0.651023
