program: Gaussian 09
title: 000226187
version: EM64L-G09RevD.01
frameworkgroup: C1[X(C22H30N2O4)]
method: RPBEPBE
basis: SDD
operation: Freq
keyword: #p
keyword: freq=noraman
keyword: PBEPBE/SDD
title: #p freq=noraman PBEPBE/SDD
converged: YES YES NO NO
title: Mulliken charges:
elementType: O O O O N N C C C C C C C C C C C C C C C C C C C C C C H H H H H H H H H H H H H H H H H H H H H H H H H H H H H H
charge: -0.291327 -0.287518 -0.291001 -0.288966 -0.148738 -0.475280 -0.409499 -0.409380 0.447179 -0.358630 -0.358071 -0.350380 -0.363238 -0.678987 -0.679025 0.503662 -0.508153 -0.380838 0.105679 0.359124 -0.523555 -0.549750 0.292872 0.236341 0.057498 -0.533027 -0.499449 -0.522336 0.213724 0.213904 0.217316 0.212197 0.202993 0.228165 0.200844 0.231319 0.227080 0.226336 0.209450 0.223469 0.207997 0.206443 0.223488 0.211641 0.214411 0.304166 0.315291 0.235361 0.288364 0.239801 0.229578 0.233756 0.226592 0.204506 0.253455 0.269497 0.204051 0.229596
chargesum: 0.00000
title: Mulliken charges with hydrogens summed into heavy atoms:
elementType: O O O O N N C C C C C C C C C C C C C C C C C C C C C C
charge: -0.291327 -0.287518 -0.291001 -0.288966 -0.148738 -0.159990 0.018129 0.020133 0.447179 0.072528 0.074092 -0.123300 -0.136902 -0.038071 -0.037453 0.503662 -0.293742 -0.076672 0.105679 0.359124 -0.288194 -0.261386 0.292872 0.236341 0.057498 0.170107 0.185105 0.180808
polarizability: 5.31619887e+02 6.11335758e+00 2.92268176e+02 -1.53621822e+00 -9.96130707e+00 1.55374178e+02
1716.lowfreq: -10.6997 -4.5249 -1.6618 -0.0010 0.0006 0.0013 7.9180 14.2680 29.6011
frequency: 5.1790 13.6873 29.4799 34.1009 40.1787 48.2011 54.9971 58.9871 75.1007 80.1104 90.7677 96.9347 99.0258 113.9003 134.5263 141.8282 154.3975 157.8370 179.6155 188.2933 202.9841 215.7024 221.1696 222.8398 234.2058 242.3848 256.1828 273.4362 282.3077 296.6122 305.9174 312.8848 330.5499 349.1495 370.0262 388.4802 401.1387 410.2314 424.2484 445.2507 472.5711 519.0568 526.9106 542.6956 566.2992 586.4384 589.8117 630.6479 636.2439 662.8694 675.1639 719.9017 724.0516 729.8339 747.1997 748.8202 751.3122 781.7315 796.2142 823.9671 839.3439 854.1781 861.6345 865.8901 868.4878 878.1792 886.5070 887.8096 918.5791 920.2076 948.1383 974.8283 980.9946 994.2805 1005.1378 1043.1588 1045.5958 1070.8120 1095.8902 1096.8458 1099.9673 1102.5657 1107.1587 1109.7955 1113.2909 1134.9619 1146.8976 1153.7235 1158.8737 1164.0388 1177.9830 1201.4134 1203.6411 1215.4484 1228.4463 1234.6869 1252.5326 1266.7091 1290.5312 1295.9191 1297.1178 1299.1262 1305.2007 1324.8963 1354.3072 1359.0795 1368.9461 1380.0347 1388.1687 1391.0752 1397.0218 1401.6514 1418.2003 1432.6588 1439.0317 1444.1130 1451.7653 1452.7979 1465.3766 1467.4653 1470.8329 1472.4036 1474.5851 1477.2623 1478.1504 1478.8475 1480.4804 1483.1804 1483.9594 1490.9201 1500.4312 1506.6765 1522.2008 1562.1252 1580.2647 1595.6814 1601.5120 1638.5190 2966.9262 2968.2496 2970.1835 2972.3332 2973.0845 2975.7779 2976.0547 2988.4574 2989.0269 3016.1405 3020.9741 3041.6240 3044.0804 3062.2395 3069.7649 3070.9958 3078.2214 3078.2557 3081.9121 3087.4572 3103.4522 3124.7146 3126.3333 3128.0921 3145.2375 3154.6462 3163.3861 3173.5271 3191.0142 3532.9420
redmass: 3.9679 4.6973 4.3694 3.8446 4.0204 3.0430 3.8455 3.4017 3.6335 3.3443 2.5104 2.2163 2.1271 2.2478 3.0563 3.9390 2.5086 1.8000 1.5171 2.9153 2.8817 1.2439 1.9929 1.2640 3.0281 3.3427 2.6118 1.7991 2.7531 3.8203 4.1875 4.8204 5.1069 4.8175 4.6076 4.8916 3.2977 4.4606 3.1665 5.9160 5.3123 2.7070 4.4357 4.2890 5.1054 4.3979 4.0213 2.5721 2.2943 2.8716 5.1246 3.7720 4.1119 4.1405 1.1450 2.9391 1.1980 6.1246 1.3880 1.5547 3.7848 1.8504 1.6290 1.3004 5.7269 1.7139 1.6520 1.4988 5.4973 1.4794 9.0547 1.3255 3.2835 3.0810 5.0983 3.0822 2.8603 5.2309 2.2064 1.7533 2.1199 2.1445 1.2456 1.2413 1.2595 1.4844 1.5098 1.4017 1.6019 1.9583 3.1509 1.2691 2.0265 1.9016 1.5708 1.4267 1.3490 1.8980 1.1995 1.1719 1.2799 1.3078 4.8013 1.6088 1.3565 1.4680 4.2627 4.5241 1.2128 1.2148 2.5296 2.7942 1.2519 3.3611 1.2743 1.3042 1.1377 1.1162 1.0638 1.5977 1.0862 1.0605 1.0540 1.0472 1.0540 1.0434 1.3507 1.0833 1.0611 1.0900 1.1852 2.5534 2.5827 8.1453 4.3775 6.3052 5.6944 6.3367 1.0365 1.0575 1.0322 1.0394 1.0378 1.0526 1.0391 1.0618 1.0619 1.0995 1.0990 1.1023 1.1023 1.1044 1.1018 1.1020 1.0988 1.0988 1.0945 1.0962 1.0895 1.1055 1.1009 1.1049 1.0909 1.0887 1.0922 1.0906 1.0948 1.0756
irintensity: 0.2622 1.3736 0.8567 0.4890 0.0829 4.5014 1.3482 2.4289 1.9640 4.0050 2.2763 1.2583 2.5368 0.4745 4.8868 8.1257 2.7809 3.6014 1.6631 2.1821 2.2412 0.4906 1.2337 0.7166 1.2312 3.4341 1.7753 2.0732 0.4112 7.6848 0.0462 6.7440 1.8889 2.6289 1.2635 0.0511 13.6824 15.2561 8.0346 2.9538 6.7575 22.2232 11.1669 17.0355 3.4873 4.0789 0.8522 9.0958 15.8463 19.6133 23.7276 3.6131 8.3676 24.9186 4.9137 23.4634 7.5720 6.3333 33.9262 57.8141 11.8159 6.0264 1.8977 2.5649 28.7860 25.3125 31.1859 5.6175 0.7932 3.2562 67.4225 6.4446 39.4170 0.8787 53.5739 0.0733 5.8591 233.4328 25.8145 20.9876 12.9902 1.0465 5.8265 19.8759 0.2119 9.7006 23.2087 34.5940 59.4468 51.8899 51.7501 14.3875 37.5560 19.0214 39.7990 70.5155 5.8165 18.7020 53.8099 1.8223 2.1769 0.8103 267.4859 136.0994 10.9825 142.1875 83.9294 62.5452 21.1156 18.0910 30.9125 85.4953 14.6748 56.6695 8.5472 17.8657 33.7068 9.8192 22.1596 223.5674 4.3349 33.4914 0.6626 5.6827 13.0264 9.8740 61.3238 0.9823 13.0533 40.4668 22.9233 226.0373 432.6468 329.2549 53.2962 9.0877 22.7522 180.4755 102.5706 21.2068 52.7274 10.9502 61.8826 126.6510 48.7079 22.8081 67.9811 11.4662 4.6204 2.7018 11.2378 37.2448 40.0951 133.8896 8.5898 74.6126 39.2613 48.8378 22.5144 18.0188 27.0783 17.2003 6.7044 23.9666 25.6477 5.4424 9.3978 8.5184
temp: 298.150 k
press: 1.00000 atm
elementType: 8 8 8 8 7 7 6 6 6 6 6 6 6 6 6 6 6 6 6 6 6 6 6 6 6 6 6 6 1 1 1 1 1 1 1 1 1 1 1 1 1 1 1 1 1 1 1 1 1 1 1 1 1 1 1 1 1 1
symmnumber: 1
zpe: 1263979.4 jmol-1
zpe.correction: 0.481424 hartree
zpe.thermalcorrener: 0.512055 hartree
zpe.thermalcorrenthalpy: 0.512999 hartree
zpe.thermalcorrgfe: 0.415277 hartree
zpe.sumelectzpe: -1264.581236 hartree
zpe.sumelectthermal: -1264.550606 hartree
zpe.sumelectthermalent: -1264.549661 hartree
zpe.sumelectthermalfe: -1264.647384 hartree
dipole: 0.9120 1.0598 0.7885
dipole: 1.6053
quadrupole: -111.4168 -154.0505 -173.0505
quadrupole: 5.6278 -11.2787 2.3600
quadrupole: 34.7558 -7.8779 -26.8779 5.6278 -11.2787 2.3600
hfenergy: -1265.0626608 hartree
pointgroup: C01 [X(C22H30N2O4)]
dipole: -0.3342292 -0.1910405 -0.5006547 debye
polarizability: 530.4654872|13.2885156|172.7198505|16.063405|-45.5300765|276.0769029 unknown
InChI: InChI=1S/C22H30N2O4/c1-6-12-24(13-7-2)18-10-8-17(9-11-18)23-22(25)16-14-19(26-3)21(28-5)20(15-16)27-4/h8-11,14-15,23H,6-7,12-13H2,1-5H3
charge 0 multiplicity 1
58 atoms
O  5.796155 0.111185 2.254886
O  4.589996 1.217743 -2.373076
O  6.598365 1.02639 -0.255306
O  0.748935 -0.84467 1.824866
N  -5.578144 -0.046328 -0.194909
N  0.116934 0.397476 -0.065012
C  -6.374991 0.742151 -1.150593
C  -6.316176 -0.943823 0.711662
C  -4.178258 0.055824 -0.146178
C  -6.528424 0.082451 -2.546316
C  -6.659685 -0.313597 2.086761
C  -3.450537 0.844109 -1.094307
C  -3.407335 -0.620458 0.852189
C  -7.377614 0.946174 -3.502995
C  -7.45219 -1.286571 2.98549
C  -1.301392 0.256736 -0.044507
C  -2.050504 0.941855 -1.03601
C  -2.005117 -0.530253 0.904776
C  1.057301 -0.153437 0.797888
C  2.49671 0.139606 0.456615
C  2.936992 0.548621 -0.820046
C  3.441671 -0.044712 1.495708
C  4.804806 0.213148 1.264361
C  4.310773 0.791346 -1.068544
C  5.266423 0.639664 -0.023009
C  5.355147 -0.226482 3.613165
C  5.90261 0.951417 -2.988217
C  7.652324 0.019348 0.000709
H  -5.937472 1.753936 -1.262133
H  -7.382634 0.893352 -0.715746
H  -5.743744 -1.879694 0.862854
H  -7.258529 -1.240314 0.210021
H  -6.99429 -0.914846 -2.420903
H  -5.52584 -0.094402 -2.979577
H  -7.246277 0.611364 1.919446
H  -5.724761 -0.003968 2.590733
H  -3.973452 1.376992 -1.893054
H  -3.904846 -1.221826 1.618402
H  -6.914189 1.938104 -3.664611
H  -7.485753 0.461647 -4.48987
H  -8.393637 1.11379 -3.097245
H  -8.403148 -1.590137 2.507305
H  -7.697772 -0.822686 3.957518
H  -6.871449 -2.206165 3.189692
H  -1.531691 1.555253 -1.785326
H  -1.442904 -1.050898 1.682166
H  0.479722 1.010677 -0.797876
H  2.268747 0.634719 -1.683284
H  3.063489 -0.386096 2.462676
H  6.270851 -0.211481 4.222408
H  4.895199 -1.232265 3.648151
H  4.636255 0.523125 3.993934
H  5.746771 1.149637 -4.060478
H  6.201705 -0.104685 -2.843298
H  6.677093 1.614735 -2.574014
H  7.64759 -0.285257 1.059107
H  7.5066 -0.864449 -0.651873
H  8.59679 0.524128 -0.253973
