program: Gaussian 09
title: 000226160
version: EM64L-G09RevD.01
frameworkgroup: C1[X(C16H22O3)]
method: RPBEPBE
basis: SDD
operation: Freq
keyword: #pfreq=noraman
keyword: PBEPBE/SDD
title: #p freq=noraman PBEPBE/SDD
converged: YES YES NO NO
title: Mulliken charges:
elementType: O O O C C C C C C C C C C C C C C C C H H H H H H H H H H H H H H H H H H H H H H
charge: -0.454638 -0.432247 -0.198377 0.259589 -0.464791 -0.445718 -0.364065 -0.399478 -0.429708 -0.425481 -0.393748 -0.362189 0.448671 0.137843 -0.463219 -0.337782 -0.230710 -0.247676 -0.242928 0.202964 0.261259 0.189697 0.237938 0.257393 0.205776 0.175277 0.196586 0.232171 0.200531 0.201752 0.205114 0.195975 0.191547 0.194602 0.332204 0.227689 0.293539 0.222887 0.223793 0.372792 0.225165
chargesum: 0.00000
title: Mulliken charges with hydrogens summed into heavy atoms:
elementType: O O O C C C C C C C C C C C C C C C C
charge: -0.122434 -0.059455 -0.198377 0.259589 -0.000569 -0.018082 -0.106671 -0.018425 -0.000952 -0.023197 0.007341 0.023959 0.448671 0.137843 -0.235530 -0.044242 -0.007823 -0.023883 -0.017763
polarizability: 1.98732186e+02 1.87651125e+01 1.66358638e+02 -1.04204605e+01 4.92491878e+00 1.57125546e+02
1716.lowfreq: -0.0010 -0.0008 -0.0005 4.7414 9.7768 11.7913 30.1615 48.3835 62.8365
frequency: 29.1055 48.3623 62.7628 67.9787 76.6547 121.8914 154.8998 169.7691 176.4602 215.7051 224.5365 243.2127 261.4457 262.5494 295.4512 305.7586 325.5465 350.0918 369.6975 398.5713 406.0821 422.8632 481.7331 487.6548 512.9401 532.2513 585.8704 602.2184 615.8158 646.0138 677.2032 703.8686 732.8870 753.9391 760.9130 789.0435 803.4366 820.9125 842.8922 851.7231 867.5183 881.8676 885.3574 905.4927 936.1517 973.5869 977.7597 983.3761 990.6325 993.9102 995.9056 1015.3536 1027.0587 1033.9496 1057.2247 1081.1847 1096.0114 1104.4783 1126.8067 1134.2829 1147.6823 1171.0178 1190.7653 1195.2029 1201.3560 1214.6381 1231.1697 1242.5851 1257.8219 1264.4503 1278.5961 1289.9375 1293.5001 1315.1166 1330.3251 1339.6898 1344.8996 1347.2913 1349.4254 1360.7509 1362.9096 1369.5883 1384.7442 1442.6694 1455.5857 1460.3292 1461.4191 1469.6968 1476.1364 1482.3206 1490.3589 1505.0625 1591.6167 1611.3291 1675.1261 2948.8633 2955.3084 2966.7444 2970.3351 2978.7690 2985.6641 2999.8706 3010.5729 3016.3446 3022.3217 3025.7987 3036.7797 3039.0506 3048.3521 3058.7026 3109.0040 3124.6286 3138.9535 3157.7279 3189.7579 3501.4292 3553.2532
redmass: 5.0983 3.8905 8.0927 3.5764 4.2223 4.8070 4.5997 3.4373 2.7251 1.4738 2.2453 2.4058 3.2645 2.6660 5.4498 2.9047 4.9979 3.7128 2.0721 3.2951 2.8118 2.1429 1.7855 3.0214 2.8087 2.3691 3.6799 1.6397 6.1787 3.0100 3.1323 1.7374 2.3020 2.2482 1.5761 3.0471 2.1004 3.7306 1.9260 1.2538 2.1235 2.2148 3.2401 1.8550 1.9548 1.4342 2.4115 2.1085 5.3559 1.5876 1.6282 2.4264 2.4570 2.1079 2.3181 1.6440 1.9928 1.9723 1.9863 1.4082 1.6916 1.0602 1.2503 1.3171 1.7063 1.3232 1.4015 1.4464 1.4326 1.2188 1.4447 1.1983 1.2732 1.6436 1.3733 1.3799 1.4032 1.4584 1.4351 1.3881 1.4227 1.4297 5.3734 2.0913 1.0853 1.0856 1.0919 1.0894 1.0846 2.2533 1.0813 1.0822 6.0193 6.0549 8.6488 1.0668 1.0607 1.0623 1.0635 1.0648 1.0660 1.0682 1.0975 1.0902 1.0948 1.0991 1.0912 1.0899 1.0961 1.0987 1.0874 1.0869 1.0933 1.0997 1.0948 1.0638 1.0657
irintensity: 0.2974 0.3511 2.0317 0.2615 0.2750 0.4359 2.9235 1.2867 0.7489 61.0355 25.9247 6.2137 7.0290 3.4444 1.8993 0.1913 1.6725 1.5593 0.4697 5.0430 0.2320 1.2407 1.6341 12.8113 1.4808 3.3654 47.0742 72.3935 3.2697 48.6460 56.4702 62.4163 10.5639 22.7249 7.9198 21.8042 9.8099 6.6050 10.7133 0.4749 4.4071 0.7203 8.4570 2.3627 3.8800 1.4270 12.5157 21.6058 3.6689 16.0905 12.7796 34.6758 56.9561 146.1296 21.0480 6.9805 31.3378 12.7565 2.7724 1.3112 5.8347 0.3632 8.3529 15.4911 3.2937 0.7269 3.1006 1.9319 5.9771 1.4578 34.0986 7.0471 3.7420 39.3721 1.0870 3.6878 3.4744 8.3871 9.4579 15.6662 10.8331 4.7325 1.9305 13.5191 12.0799 8.2141 3.9792 6.9398 11.7638 23.4819 14.5544 20.3120 0.7526 3.1041 190.3185 24.6110 28.5044 27.4739 14.7818 43.5136 18.3843 16.5208 62.5368 21.2339 36.1683 93.5183 64.3438 45.7006 33.2532 19.3504 10.2481 2.1331 35.0969 34.1773 1.5973 18.6849 3.7603
temp: 298.150 k
press: 1.00000 atm
elementType: 8 8 8 6 6 6 6 6 6 6 6 6 6 6 6 6 6 6 6 1 1 1 1 1 1 1 1 1 1 1 1 1 1 1 1 1 1 1 1 1 1
symmnumber: 1
zpe: 913360.6 jmol-1
zpe.correction: 0.347881 hartree
zpe.thermalcorrener: 0.366170 hartree
zpe.thermalcorrenthalpy: 0.367114 hartree
zpe.thermalcorrgfe: 0.301764 hartree
zpe.sumelectzpe: -847.115796 hartree
zpe.sumelectthermal: -847.097507 hartree
zpe.sumelectthermalent: -847.096563 hartree
zpe.sumelectthermalfe: -847.161913 hartree
dipole: 3.1546 -1.4596 -0.8514
dipole: 3.5787
quadrupole: -113.4074 -109.8849 -110.3969
quadrupole: 6.4880 4.1232 -3.4796
quadrupole: -2.1777 1.3448 0.8329 6.4880 4.1232 -3.4796
hfenergy: -847.4636767 hartree
pointgroup: C01 [X(C16H22O3)]
dipole: -1.2388121 -0.5782207 0.3366458 debye
polarizability: 198.6170625|-18.6714|166.442279|-10.8668752|-4.7188051|157.1570283 unknown
InChI: InChI=1S/C16H22O3/c17-15(18)14(13-9-5-4-6-10-13)16(19)11-7-2-1-3-8-12-16/h4-6,9-10,14,17,19H,1-3,7-8,11-12H2
charge 0 multiplicity 1
41 atoms
O  -0.207643 0.660587 -2.016557
O  0.10065 3.130748 0.878301
O  1.731516 2.695055 -0.70611
C  -0.715691 0.353644 -0.648425
C  -0.928828 -1.182567 -0.527084
C  -2.002281 1.2003 -0.450034
C  0.450689 0.802614 0.320439
C  -2.19282 -1.762615 -1.227024
C  -2.703097 1.206816 0.929973
C  -3.381654 -2.107435 -0.291152
C  -3.288268 -0.134356 1.449302
C  -4.123693 -0.939503 0.411626
C  1.677444 -0.109977 0.300268
C  0.855197 2.257152 0.062265
C  2.004886 -0.854374 1.461126
C  2.501521 -0.231889 -0.849094
C  3.126128 -1.715484 1.478767
C  3.621188 -1.092061 -0.831598
C  3.937777 -1.838311 0.328459
H  -0.939645 -1.473788 0.539653
H  -0.023021 -1.649951 -0.953545
H  -2.731425 0.874954 -1.219285
H  -1.744911 2.244201 -0.707203
H  0.015191 0.777855 1.334924
H  -1.901243 -2.701137 -1.738083
H  -2.548767 -1.088484 -2.035936
H  -3.541969 1.927668 0.844279
H  -2.022284 1.636594 1.689576
H  -3.012512 -2.804381 0.490414
H  -4.126578 -2.677303 -0.88408
H  -3.928542 0.10921 2.320373
H  -2.484633 -0.783304 1.849399
H  -4.541228 -0.248319 -0.349427
H  -5.000049 -1.381234 0.926583
H  -0.842831 0.275548 -2.673044
H  1.381816 -0.7571 2.359824
H  2.256941 0.351103 -1.739822
H  3.36573 -2.282529 2.385546
H  4.251684 -1.177214 -1.724138
H  0.389812 4.065792 0.691578
H  4.809642 -2.502525 0.337662
