program: Gaussian 09
title: 000226153
version: EM64L-G09RevD.01
frameworkgroup: C1[X(C15H20O3)]
method: RPBEPBE
basis: SDD
operation: Freq
keyword: #pfreq=noraman
keyword: PBEPBE/SDD
title: #p freq=noraman PBEPBE/SDD
converged: NO YES NO NO
title: Mulliken charges:
elementType: O O O C C C C C C C C C C C C C C C H H H H H H H H H H H H H H H H H H H H
charge: -0.443935 -0.420809 -0.219090 0.304714 -0.513956 -0.485186 0.012224 -0.413272 -0.440389 -0.350364 -0.744640 0.422993 0.119965 -0.434957 -0.428163 -0.232346 -0.238562 -0.238823 0.235813 0.193441 0.219920 0.229777 0.187109 0.191942 0.208656 0.224552 0.191560 0.259680 0.212387 0.212921 0.211003 0.348813 0.235602 0.317434 0.374516 0.227944 0.230336 0.231192
chargesum: 0.00000
title: Mulliken charges with hydrogens summed into heavy atoms:
elementType: O O O C C C C C C C C C C C C C C C
charge: -0.095122 -0.046293 -0.219090 0.304714 -0.084702 -0.035489 0.199333 -0.012674 -0.024277 -0.090684 -0.108330 0.422993 0.119965 -0.199354 -0.110729 -0.004403 -0.008226 -0.007632
polarizability: 1.93803839e+02 -2.08355360e+01 1.58579309e+02 1.00230473e+01 6.48484772e+00 1.45348302e+02
1716.lowfreq: -25.4150 -13.8041 -6.3599 0.0008 0.0008 0.0010 32.9165 54.0736 55.8497
frequency: 32.5710 53.8888 55.8168 62.8458 83.7844 119.2378 155.7473 188.0543 205.7709 220.0351 226.7888 232.1781 274.9717 297.8503 301.6716 326.2257 364.6557 380.6710 414.9944 422.6987 425.5505 456.2224 484.6052 505.2367 543.8827 590.1271 615.6053 634.7375 673.0258 694.0034 711.5810 747.9984 776.2267 782.5878 811.6676 830.5348 862.8023 880.6402 903.8729 909.2320 925.3745 934.7759 943.2807 976.0559 983.0005 986.2822 989.7871 1004.1698 1017.5248 1029.6492 1039.5877 1055.7143 1084.3716 1089.8653 1094.2487 1120.5424 1144.3648 1163.3519 1173.6538 1194.7213 1195.3352 1217.6147 1219.9012 1236.5941 1262.1979 1274.1294 1300.2241 1310.1559 1321.1649 1324.7142 1339.4581 1342.4532 1350.4257 1355.3685 1374.0640 1384.0236 1388.7611 1441.7087 1445.9282 1452.5242 1460.6332 1468.7836 1475.4387 1478.7277 1481.2568 1588.1216 1609.5845 1660.9735 2933.8524 2965.2831 2966.1729 2978.0013 2980.9419 2989.1546 3026.2997 3037.0652 3040.5922 3045.5363 3054.9484 3063.0325 3064.3116 3118.9390 3128.7722 3141.7843 3154.9978 3165.8794 3500.7636 3508.8367
redmass: 3.9058 6.4607 3.8172 4.2420 4.3653 5.6930 4.8863 2.2844 2.8113 1.1566 2.9488 4.1115 5.0838 3.1509 3.2467 5.0907 1.3195 2.1013 2.5169 2.3450 2.0194 3.5149 3.2676 3.3286 2.5328 3.2482 6.2504 1.8156 3.5891 3.8612 1.9395 2.0045 1.5312 2.2972 3.7835 4.9186 1.2493 2.9884 1.9355 2.1545 1.9632 1.5059 1.8153 1.5949 3.0851 1.6492 3.3891 1.3578 1.8690 2.3828 2.1702 2.1120 1.6503 1.6403 2.5057 1.5060 2.1457 1.7677 1.0624 1.8500 1.1290 1.2805 1.3703 1.7856 1.2866 1.4899 1.3766 1.3183 1.3408 1.4847 1.4363 1.4709 1.6291 1.7697 1.6396 4.2345 1.2607 2.0798 1.1033 1.0872 1.0905 1.0866 1.0519 1.0571 2.2234 5.9245 5.9593 8.1954 1.0825 1.0602 1.0360 1.0604 1.0598 1.0621 1.0983 1.1009 1.1011 1.0868 1.1007 1.0992 1.0992 1.0866 1.0873 1.0928 1.0952 1.1009 1.0638 1.0653
irintensity: 0.2579 1.6875 0.3542 0.7778 0.7431 0.1940 1.4864 0.7604 0.0965 0.0963 2.2784 1.0422 1.6420 4.4904 4.6854 5.5821 163.8763 13.1383 24.6810 8.1662 4.1980 4.3847 8.7277 1.5720 30.8262 45.9065 4.2794 121.4518 13.4820 21.8894 42.6119 31.8615 0.8967 4.9030 6.6182 6.9217 0.2980 7.8775 10.9400 9.9436 5.9930 12.8497 3.2061 21.8460 27.0719 4.1859 1.3925 2.3788 9.0211 23.1296 226.7808 72.4849 13.3133 1.1604 11.4440 11.9837 23.1812 10.3591 0.4221 0.2649 0.9063 8.9101 8.6624 1.1230 3.6215 5.7902 10.3851 3.9498 6.0106 17.7395 2.9380 3.9968 9.9968 26.3198 29.6171 6.8577 5.0955 11.7775 11.0563 5.4999 9.7064 4.5388 14.9034 9.3839 25.9599 1.9804 6.5603 163.3170 25.7280 24.2059 34.1053 45.5356 58.8223 18.1458 32.3222 14.0122 22.6169 5.9108 20.2916 87.5802 44.2550 6.5027 2.3834 28.6111 10.3008 23.2467 22.9096 8.6073
temp: 298.150 k
press: 1.00000 atm
elementType: 8 8 8 6 6 6 6 6 6 6 6 6 6 6 6 6 6 6 1 1 1 1 1 1 1 1 1 1 1 1 1 1 1 1 1 1 1 1
symmnumber: 1
zpe: 836407.1 jmol-1
zpe.correction: 0.318571 hartree
zpe.thermalcorrener: 0.335984 hartree
zpe.thermalcorrenthalpy: 0.336928 hartree
zpe.thermalcorrgfe: 0.273302 hartree
zpe.sumelectzpe: -807.916539 hartree
zpe.sumelectthermal: -807.899125 hartree
zpe.sumelectthermalent: -807.898181 hartree
zpe.sumelectthermalfe: -807.961808 hartree
dipole: 0.1656 -1.3619 -2.1977
dipole: 2.5908
quadrupole: -104.6555 -101.8278 -108.8905
quadrupole: -6.7595 2.4686 -3.1466
quadrupole: 0.4691 3.2968 -3.7659 -6.7595 2.4686 -3.1466
hfenergy: -808.2351097 hartree
pointgroup: C01 [X(C15H20O3)]
dipole: -0.0731854 -0.6254212 0.8015461 debye
polarizability: 193.1758054|19.9321212|160.0557968|12.9544628|-4.5580565|144.4998484 unknown
InChI: InChI=1S/C15H20O3/c1-11-7-9-15(18,10-8-11)13(14(16)17)12-5-3-2-4-6-12/h2-6,11,13,16,18H,7-10H2,1H3
charge 0 multiplicity 1
38 atoms
O  0.683358 0.100324 -1.484394
O  -0.422992 2.90882 1.572306
O  -1.084428 2.733768 -0.64099
C  0.837343 0.171175 -0.02365
C  1.1998 -1.23077 0.543479
C  1.992646 1.169826 0.213397
C  3.702955 -0.749436 0.279806
C  2.549689 -1.742482 -0.006953
C  3.34406 0.636615 -0.311957
C  -0.515261 0.681954 0.665971
C  5.048179 -1.269487 -0.267897
C  -1.73092 -0.146371 0.248397
C  -0.720951 2.167947 0.412261
C  -2.224133 -1.148649 1.123765
C  -2.365163 0.034028 -1.011746
C  -3.317143 -1.961774 0.751334
C  -3.458978 -0.78175 -1.382658
C  -3.936241 -1.78395 -0.507768
H  0.390667 -1.948396 0.305805
H  1.257545 -1.164231 1.649633
H  2.06047 1.381419 1.29857
H  1.749037 2.120496 -0.296467
H  3.791853 -0.639867 1.38434
H  2.777072 -2.731522 0.437763
H  2.467238 -1.886568 -1.102549
H  3.289776 0.552346 -1.414644
H  4.142572 1.367812 -0.076867
H  -0.359289 0.570492 1.753003
H  5.001122 -1.390512 -1.367341
H  5.873051 -0.567982 -0.041503
H  5.308358 -2.251996 0.16941
H  -0.078418 -0.501842 -1.694766
H  -1.753455 -1.287115 2.104823
H  -2.029965 0.842505 -1.669393
H  -0.543918 3.878006 1.37454
H  -3.687266 -2.727262 1.442557
H  -3.942664 -0.627003 -2.353799
H  -4.786203 -2.41177 -0.797615
