program: Gaussian 09
title: 000018715
version: EM64L-G09RevD.01
frameworkgroup: C1[X(C23H30N2)]
method: RPBEPBE
basis: SDD
operation: Freq
keyword: #pfreq=noraman
keyword: PBEPBE/SDD
title: #p freq=noraman PBEPBE/SDD
converged: YES YES NO NO
title: Mulliken charges:
elementType: N N C C C C C C C C C C C C C C C C C C C C C C C H H H H H H H H H H H H H H H H H H H H H H H H H H H H H H
charge: -0.082702 -0.170351 -0.330350 -0.397667 -0.354308 -0.438401 -0.359291 -0.356391 -0.396835 -0.391660 -0.397922 0.398635 0.378325 0.350174 0.221457 -0.661371 -0.444212 -0.413673 -0.436721 -0.368985 -0.667462 -0.247618 -0.291028 -0.246628 -0.259079 0.193351 0.215335 0.232832 0.187001 0.197687 0.231073 0.193130 0.167778 0.224610 0.210187 0.164803 0.191643 0.198737 0.202539 0.190236 0.211565 0.188776 0.219820 0.242293 0.237549 0.221244 0.228199 0.234210 0.226860 0.242480 0.218240 0.225989 0.221730 0.225320 0.218846
chargesum: 0.00000
title: Mulliken charges with hydrogens summed into heavy atoms:
elementType: N N C C C C C C C C C C C C C C C C C C C C C C C
charge: -0.082702 -0.170351 -0.136999 0.050500 0.030380 -0.014197 0.033097 0.018599 -0.006456 0.001115 0.002419 0.398635 0.378325 0.350174 0.221457 -0.199258 -0.206663 -0.192429 -0.208522 -0.134775 0.020118 -0.021629 -0.069297 -0.021308 -0.040233
polarizability: 2.45461807e+02 -3.83540822e+01 2.71594867e+02 6.92456369e+00 1.51598382e+01 2.46487613e+02
1716.lowfreq: -12.6199 -10.0882 -6.7113 -0.0002 0.0005 0.0007 6.0067 14.2123 32.5491
frequency: -7.2576 13.3325 32.4171 40.3929 54.9079 61.2858 74.5878 99.9248 127.5026 146.7308 184.4310 201.5258 209.5978 218.4053 230.5448 247.8977 269.6449 274.6669 309.7876 312.5448 325.5674 329.3298 363.5335 388.0498 395.0449 417.5301 447.9814 451.3788 462.8541 508.4748 512.3189 529.8780 539.5110 552.7715 584.0041 606.1455 612.2128 639.8573 699.0290 715.7326 728.7560 740.1129 747.5731 756.6860 765.4184 796.0460 804.2716 829.8839 837.6640 845.2132 851.2505 857.7366 880.7389 889.5387 910.9199 926.3743 929.1476 945.0143 949.1494 958.1008 962.9119 976.5052 983.7513 999.0287 1018.2833 1041.3867 1044.7146 1053.7964 1056.3104 1069.8459 1076.2994 1092.8606 1104.7157 1112.2362 1114.7729 1121.2491 1129.4071 1148.2541 1149.1992 1159.0311 1161.3639 1172.1846 1175.9253 1199.5070 1202.1798 1211.1600 1223.2069 1240.5081 1251.4921 1255.3267 1263.6930 1268.9630 1276.0911 1285.8821 1294.5196 1300.4110 1311.2799 1327.4779 1329.7242 1338.2693 1340.1733 1344.4786 1347.5731 1354.6888 1366.8942 1367.8184 1380.4312 1389.4670 1394.4700 1431.3215 1439.5632 1450.7965 1451.0103 1459.3352 1459.9779 1460.9900 1465.0374 1468.6257 1470.9555 1475.0014 1480.7628 1481.8572 1485.0235 1494.7986 1507.2326 1573.6264 1594.0289 1607.8815 1612.2248 2808.4055 2816.5860 2838.7686 2917.5471 2964.7774 2965.0316 2973.8596 2981.2252 2983.4768 2984.0483 2988.5721 2998.9859 3018.7346 3019.6422 3029.3594 3031.9302 3041.5610 3043.9968 3051.8888 3054.1073 3060.3378 3078.9731 3101.1002 3109.2474 3114.4708 3124.8591 3135.0547 3151.5286 3157.7736 3165.3674
redmass: 4.2184 4.1096 3.3837 3.6251 3.3757 3.8834 3.2573 3.3728 3.3354 3.0785 2.6430 1.5573 2.0776 3.5188 2.5223 2.1617 2.8559 3.3826 3.1286 2.1189 3.4384 4.2860 3.1970 1.8655 2.4924 3.2436 2.8896 3.2832 3.4324 3.2118 3.2649 2.6608 2.0842 3.6901 2.8534 4.4426 4.9382 4.8153 3.5052 2.1212 3.2041 3.1542 1.3973 3.7434 1.3590 1.9794 1.5034 2.8174 1.5332 2.1500 2.2795 1.9929 1.6796 2.0691 2.2782 1.6572 1.6967 2.2924 1.6545 1.2985 1.3063 2.7001 1.3353 2.8606 2.6998 2.1268 2.2392 2.1799 2.1760 1.8155 2.3207 1.7812 1.3307 2.0275 2.4367 2.2656 1.5881 1.6784 1.2817 1.9869 1.7650 1.0741 1.2131 1.7478 1.8130 1.6075 1.6839 1.5517 1.4919 1.5819 1.2163 1.4611 1.2889 1.3096 1.1817 1.3638 1.5607 1.3135 1.6567 1.3912 1.4768 1.6430 1.5359 1.4810 1.4883 2.2615 3.5142 1.4202 2.9118 1.9436 2.0230 1.1247 1.3865 1.0862 1.0887 1.1100 1.1092 1.0945 1.0804 1.0832 1.1029 1.1043 2.5807 1.3849 1.5937 6.8618 6.6430 6.2251 6.2965 1.0716 1.0708 1.0699 1.0489 1.0623 1.0827 1.0627 1.0614 1.0615 1.0645 1.0635 1.0882 1.0848 1.0875 1.0946 1.0942 1.0985 1.0916 1.1034 1.0995 1.0994 1.0982 1.0880 1.0868 1.0890 1.0870 1.0923 1.0931 1.1004 1.0981
irintensity: 0.0725 0.0892 0.4538 0.1317 0.9879 0.4666 0.4020 0.6277 0.4830 0.8843 3.1443 0.5690 0.7408 0.3378 1.4261 0.7479 0.1087 0.6396 1.0401 4.4745 1.2040 2.1021 1.3241 5.0064 0.7837 0.7827 0.4978 5.4780 1.0369 0.8393 7.4718 11.6597 0.3330 1.3083 5.7204 11.9006 6.4507 2.7064 12.8512 9.8866 2.4953 5.7476 83.1058 1.2143 58.2553 2.8495 0.4306 5.3776 3.2767 1.7589 4.2958 3.5005 4.3719 2.5177 1.5832 4.8590 4.9562 5.9397 4.6632 2.8854 0.5234 20.2941 0.1017 10.1208 5.2335 3.9882 19.0443 8.3700 14.0044 3.0044 5.7935 6.2255 4.7979 6.2875 36.3201 6.4093 9.6788 12.0932 5.0130 8.3649 4.2520 0.0760 0.7474 6.4923 30.8734 16.3860 3.6169 11.9923 12.6968 17.4066 4.0066 6.7346 1.5102 2.6784 4.7573 4.1064 21.8405 10.0516 51.7034 1.8972 5.6270 15.2549 1.9317 10.6107 3.0366 7.1105 17.7092 1.4766 4.3634 32.2288 3.5605 3.0665 7.7641 9.1176 9.5818 5.0395 6.9823 14.4090 2.1678 11.7611 13.7591 12.8598 8.4829 9.3786 146.8745 13.1167 1.4777 32.4972 38.9927 44.9936 80.1683 240.9350 121.9205 43.3381 10.9333 39.5008 28.8781 29.2878 23.1965 55.8582 8.8723 31.3977 50.3500 61.8578 38.0937 45.4875 6.7452 104.7275 33.3093 29.4484 25.9054 16.1407 14.2586 2.6575 11.9276 25.7987 32.6084 38.1601 26.7225
temp: 298.150 k
press: 1.00000 atm
elementType: 7 7 6 6 6 6 6 6 6 6 6 6 6 6 6 6 6 6 6 6 6 6 6 6 6 1 1 1 1 1 1 1 1 1 1 1 1 1 1 1 1 1 1 1 1 1 1 1 1 1 1 1 1 1 1
symmnumber: 1
zpe: 1253159.5 jmol-1
zpe.correction: 0.477303 hartree
zpe.thermalcorrener: 0.499296 hartree
zpe.thermalcorrenthalpy: 0.500240 hartree
zpe.thermalcorrgfe: 0.425378 hartree
zpe.sumelectzpe: -1002.067951 hartree
zpe.sumelectthermal: -1002.045958 hartree
zpe.sumelectthermalent: -1002.045014 hartree
zpe.sumelectthermalfe: -1002.119876 hartree
dipole: -1.6736 1.1491 0.8122
dipole: 2.1866
quadrupole: -151.9405 -147.2242 -138.7311
quadrupole: 0.8268 5.8728 4.7584
quadrupole: -5.9752 -1.2590 7.2342 0.8268 5.8728 4.7584
hfenergy: -1002.5452542 hartree
pointgroup: C01 [X(C23H30N2)]
dipole: -0.6493377 -0.440228 -0.3530508 debye
polarizability: 244.8405476|38.1999534|270.6051364|-5.0041599|16.9339762|248.0986022 unknown
InChI: InChI=1S/C23H30N2/c1-24-18-19-10-3-4-11-20(19)21(22-12-5-6-14-23(22)24)13-9-17-25-15-7-2-8-16-25/h3-6,10-12,14,21H,2,7-9,13,15-18H2,1H3
charge 0 multiplicity 1
55 atoms
N  -3.362616 0.926404 0.363573
N  2.302442 -0.150072 -1.653568
C  0.982339 0.185244 1.217663
C  -0.382203 0.950924 1.06528
C  -2.8520 1.123635 1.745178
C  -1.492635 0.435253 2.004447
C  -3.790574 -0.471026 0.099128
C  -4.44224 1.890215 0.029985
C  -4.185764 -0.662398 -1.379834
C  -4.854235 1.777587 -1.451983
C  -5.293427 0.334574 -1.788567
C  0.854128 -1.29177 0.839595
C  2.155187 0.977152 0.589582
C  0.742487 -1.709971 -0.516485
C  2.755662 0.792586 -0.710288
C  0.921956 -0.673106 -1.613536
C  0.783286 -2.274984 1.856589
C  2.700695 1.981306 1.43178
C  0.545061 -3.075939 -0.823051
C  3.887134 1.602672 -1.054134
C  3.156183 -0.55504 -2.775471
C  0.590196 -3.642018 1.549113
C  3.80274 2.785504 1.077041
C  0.463104 -4.046723 0.201978
C  4.404505 2.576681 -0.182886
H  1.191294 0.196774 2.30721
H  -0.190715 2.022113 1.27594
H  -0.759045 0.904462 0.028279
H  -3.594021 0.769442 2.508579
H  -2.732174 2.214815 1.897879
H  -1.595748 -0.661733 1.903988
H  -1.21134 0.621939 3.061916
H  -4.661963 -0.750407 0.752275
H  -2.960642 -1.15452 0.35133
H  -4.072947 2.911055 0.243916
H  -5.348737 1.722392 0.673443
H  -4.519516 -1.706225 -1.537795
H  -3.289166 -0.498138 -2.009452
H  -3.987973 2.05737 -2.082518
H  -5.670556 2.495307 -1.663028
H  -5.525092 0.239539 -2.866559
H  -6.225507 0.0954 -1.234959
H  0.693853 -1.116848 -2.598252
H  0.219059 0.170813 -1.477999
H  0.879462 -1.965172 2.904707
H  2.247856 2.11446 2.42371
H  0.458342 -3.383175 -1.873213
H  4.348092 1.485324 -2.039071
H  2.794466 -1.517194 -3.176908
H  4.198934 -0.707381 -2.440581
H  3.1667 0.181636 -3.60959
H  0.538645 -4.382492 2.355309
H  4.188843 3.539357 1.770776
H  0.308979 -5.102593 -0.047303
H  5.268405 3.17529 -0.494659
