program: Gaussian 09
title: 000226193
version: EM64L-G09RevD.01
frameworkgroup: C1[X(C21H28N2O2)]
method: RPBEPBE
basis: SDD
operation: Freq
keyword: #p
keyword: freq=noraman
keyword: PBEPBE/SDD
title: #p freq=noraman PBEPBE/SDD
converged: YES YES NO NO
title: Mulliken charges:
elementType: O O N N C C C C C C C C C C C C C C C C C C C C C H H H H H H H H H H H H H H H H H H H H H H H H H H H H
charge: -0.293807 -0.268323 -0.086958 -0.337742 -0.336594 -0.382988 -0.315408 -0.386424 -0.685072 -0.695923 -0.703011 0.183205 0.505035 -0.445847 0.492900 0.345865 -0.434377 -0.390241 -0.390836 -0.335652 -0.447896 -0.372603 -0.221838 -0.226895 -0.248513 0.214076 0.199981 0.218984 0.211834 0.186667 0.221956 0.246076 0.232324 0.223054 0.221307 0.214948 0.227726 0.211666 0.213479 0.335972 0.224852 0.225362 0.242772 0.262481 0.235532 0.247365 0.253245 0.256782 0.230919 0.241965 0.225055 0.225327 0.228234
chargesum: 0.00000
title: Mulliken charges with hydrogens summed into heavy atoms:
elementType: O O N N C C C C C C C C C C C C C C C C C C C C C
charge: -0.293807 -0.268323 -0.086958 -0.001770 0.077463 0.047831 0.093215 0.091976 -0.025764 -0.043052 -0.252797 0.183205 0.505035 0.059406 0.492900 0.345865 -0.198844 -0.142877 -0.137591 -0.078869 -0.216977 -0.130638 0.003217 -0.001568 -0.020279
polarizability: 2.58822394e+02 2.50469019e+01 2.54039281e+02 -4.45597594e+00 -4.28256232e+00 2.17848402e+02
1716.lowfreq: -11.6832 -6.1014 -2.8448 -0.0006 -0.0001 0.0005 6.1587 11.2363 16.1889
frequency: 5.8513 9.8455 16.1639 24.1616 26.6978 35.9261 44.6762 49.8643 56.9134 64.7416 88.2950 100.1401 130.5150 163.8473 185.6075 191.4940 210.2755 232.8001 260.1781 266.5984 273.3235 283.1848 298.0809 310.9534 334.6112 359.9342 378.8758 399.8816 403.9555 413.0816 452.8161 484.5929 494.1716 504.0114 515.1385 546.8948 579.3501 598.2137 616.9301 632.4698 654.0517 659.8767 700.7931 704.4000 726.3384 746.5639 759.1634 767.5244 771.8087 798.5597 801.4280 825.1944 829.1842 837.9903 854.9975 869.2718 897.9611 907.0178 939.5895 963.7342 966.0316 975.0990 977.2352 983.9551 990.6580 995.4407 998.9453 1006.4405 1023.1545 1026.7957 1050.8040 1065.8883 1073.8308 1081.1013 1085.0814 1086.8990 1115.1204 1116.8955 1171.2165 1173.4831 1179.1233 1184.8224 1188.1465 1197.3644 1199.8085 1204.7389 1220.9646 1231.3496 1238.6428 1254.8234 1281.6636 1285.7237 1298.2341 1314.8303 1321.4167 1323.2846 1334.2224 1337.3191 1340.8071 1370.9732 1373.7230 1379.0547 1379.4273 1382.5910 1387.0222 1414.4519 1439.7227 1449.9480 1452.7766 1458.7114 1460.7513 1466.5472 1472.4339 1476.3151 1480.4831 1484.2706 1486.8804 1491.0254 1496.7718 1507.8812 1585.2917 1594.1532 1614.1688 1619.6452 1623.0244 2867.0539 2900.7498 2966.9262 2977.6706 2983.2746 2989.6600 3011.8729 3019.2769 3021.4341 3025.4704 3027.4446 3040.2394 3072.2356 3076.2707 3081.1953 3089.2962 3091.2564 3094.8865 3113.1248 3119.4351 3123.6424 3132.0282 3132.8804 3143.5870 3159.2106 3161.9976 3163.8227 3521.2523
redmass: 4.7312 3.9187 3.6076 4.0076 4.1894 5.5100 2.7612 4.7063 3.4147 4.8296 2.6671 3.2019 3.3392 1.6549 4.3849 3.1825 1.2057 4.3943 2.8771 2.8359 1.7088 2.3834 3.6983 3.2289 2.6044 3.8952 4.7312 2.3081 2.8076 2.9747 3.3996 2.7550 3.0166 2.9487 4.0252 4.8756 3.6839 4.2738 6.3141 6.0313 1.1409 3.7334 3.7192 2.1299 2.1294 2.8463 2.6405 1.3673 1.1332 2.4627 1.2042 3.3150 1.4023 1.8380 1.2485 2.7847 2.0455 1.4543 1.4878 1.6483 1.3636 2.4916 1.3917 6.5250 6.0900 1.3289 2.4035 2.5923 3.5878 2.2121 2.4546 2.0808 1.9466 1.5914 3.7550 2.2254 1.6741 1.3705 1.0843 1.7403 1.5874 1.2339 1.1575 2.4307 1.3585 2.0893 1.9166 1.6939 1.7620 1.5705 1.1646 1.6844 1.1564 1.3468 1.3140 1.2725 1.3538 1.3475 1.2296 1.2811 1.3026 1.2984 4.1892 7.7710 1.2574 3.0019 2.0783 1.0897 1.0865 1.0681 1.1518 1.0495 1.0710 1.0529 1.0490 2.2483 1.1360 1.9124 1.1142 2.0925 6.9343 6.1356 6.1267 6.5429 7.7197 1.0717 1.0682 1.0596 1.0351 1.0371 1.0606 1.0999 1.0900 1.0583 1.0639 1.0849 1.1003 1.0989 1.0988 1.1008 1.1005 1.1057 1.1048 1.0873 1.0863 1.0892 1.0887 1.0911 1.0960 1.0947 1.1015 1.0955 1.0772
irintensity: 0.0574 0.1441 0.1112 0.0711 0.8749 1.8270 0.3350 3.2903 1.1322 4.1706 0.1661 0.4263 0.9254 2.5332 4.0027 3.3262 1.4601 1.1180 1.2686 1.1127 0.3492 2.1699 1.3425 9.2440 1.9613 28.6050 4.4552 4.8440 0.3224 0.1558 4.1967 10.0907 12.5514 7.7570 7.9280 9.3679 17.0524 17.4297 0.5554 1.7527 133.0441 7.5482 9.8536 31.4625 29.1270 2.9777 42.3017 9.9445 5.0240 37.6426 3.5839 2.5065 1.6122 41.6784 0.1797 7.8782 1.2831 4.3429 3.1099 2.0645 0.2168 12.1932 0.0709 62.0243 0.2443 0.7729 14.3598 5.5724 6.2556 9.2103 6.3162 15.6991 40.0197 12.1726 8.8082 21.2629 13.6876 14.0625 5.0392 82.7261 61.5484 23.5433 2.9368 1.9457 23.1276 24.6395 9.9791 109.8575 18.9122 24.8410 10.9797 2.4313 10.3743 0.9160 3.3310 5.0815 1.1118 4.2822 9.3193 12.0088 5.5083 15.6521 7.6823 2.2125 25.0009 0.5082 5.9108 23.6370 19.9236 10.4984 23.7561 15.6742 0.9923 2.0294 6.3729 28.9223 47.2491 185.3317 7.5746 103.7250 2.7148 2.3336 8.1701 79.6908 147.6535 72.2482 81.7725 29.7474 26.2536 27.6785 45.4409 13.1865 14.8024 24.6149 40.2366 16.4364 16.8970 43.3655 64.3180 49.5120 42.1783 9.3506 13.4735 9.5245 3.2055 15.5751 12.3160 10.9049 42.5737 9.8775 26.4077 3.9801 32.3093
temp: 298.150 k
press: 1.00000 atm
elementType: 8 8 7 7 6 6 6 6 6 6 6 6 6 6 6 6 6 6 6 6 6 6 6 6 6 1 1 1 1 1 1 1 1 1 1 1 1 1 1 1 1 1 1 1 1 1 1 1 1 1 1 1 1
symmnumber: 1
zpe: 1174835.2 jmol-1
zpe.correction: 0.447471 hartree
zpe.thermalcorrener: 0.473293 hartree
zpe.thermalcorrenthalpy: 0.474238 hartree
zpe.thermalcorrgfe: 0.384194 hartree
zpe.sumelectzpe: -1075.096965 hartree
zpe.sumelectthermal: -1075.071142 hartree
zpe.sumelectthermalent: -1075.070198 hartree
zpe.sumelectthermalfe: -1075.160242 hartree
dipole: 1.1994 1.4056 2.6460
dipole: 3.2274
quadrupole: -153.2779 -142.2090 -151.2422
quadrupole: -3.8201 -9.1449 -4.4685
quadrupole: -4.3682 6.7007 -2.3325 -3.8201 -9.1449 -4.4685
hfenergy: -1075.5444358 hartree
pointgroup: C01 [X(C21H28N2O2)]
dipole: 0.3689287 0.4085769 -1.1441994 debye
polarizability: 254.8864279|-18.300726|238.5571325|-17.5993511|20.6482074|237.2665167 unknown
InChI: InChI=1S/C21H28N2O2/c1-3-23(4-2)15-14-22-21(24)17-25-20-12-10-19(11-13-20)16-18-8-6-5-7-9-18/h5-13,22H,3-4,14-17H2,1-2H3
charge 0 multiplicity 1
53 atoms
O  -0.608152 3.003332 2.649008
O  -2.898264 0.268192 3.562216
N  -5.043222 -0.070265 -0.592413
N  -3.051115 1.951106 1.94053
C  -3.841669 0.542552 0.014716
C  -5.043968 -0.090622 -2.075824
C  -5.441025 -1.342438 0.064544
C  -4.227407 1.395039 1.254143
C  -4.009218 -1.031343 -2.754452
C  -6.90049 -1.74468 -0.219105
C  3.031782 1.238353 -1.491055
C  -2.462627 1.32797 3.015043
C  2.09267 1.667153 -0.363781
C  -1.225908 2.051756 3.585265
C  3.955062 0.064326 -1.168101
C  0.27464 2.484577 1.66797
C  1.888359 3.041294 -0.074761
C  1.366735 0.714799 0.392979
C  0.99129 3.454439 0.930576
C  0.458644 1.106129 1.401769
C  4.057766 -1.037642 -2.053309
C  4.754411 0.066521 0.005038
C  4.93946 -2.109641 -1.781132
C  5.636702 -1.000511 0.280578
C  5.733982 -2.09401 -0.61281
H  -3.080212 -0.210473 0.32736
H  -3.354408 1.197741 -0.732935
H  -6.060531 -0.360651 -2.417085
H  -4.870105 0.947036 -2.420551
H  -4.760668 -2.18545 -0.214824
H  -5.318531 -1.20276 1.154524
H  -4.768141 0.769566 1.984371
H  -4.897221 2.213782 0.937633
H  -2.976411 -0.774522 -2.454467
H  -4.18743 -2.090471 -2.49429
H  -4.075781 -0.940089 -3.854837
H  -7.582352 -0.917742 0.046955
H  -7.065108 -1.999608 -1.281748
H  -7.172651 -2.63279 0.380483
H  -2.589771 2.788112 1.573173
H  2.430901 0.975652 -2.385215
H  3.644959 2.113702 -1.785793
H  -0.502436 1.295244 3.93822
H  -1.539914 2.668332 4.444762
H  2.443338 3.800656 -0.639373
H  1.514722 -0.353274 0.196076
H  0.842332 4.513373 1.163436
H  -0.09368 0.339291 1.953689
H  3.443461 -1.056996 -2.962557
H  4.67684 0.906512 0.705962
H  5.003872 -2.953631 -2.477413
H  6.247859 -0.981158 1.190262
H  6.417723 -2.923067 -0.398551
