program: Gaussian 09
title: 000226151
version: EM64L-G09RevD.01
frameworkgroup: C1[X(C15H18O3)]
method: RPBEPBE
basis: SDD
operation: Freq
keyword: #pfreq=noraman
keyword: PBEPBE/SDD
title: #p freq=noraman PBEPBE/SDD
converged: YES YES NO NO
title: Mulliken charges:
elementType: O O O C C C C C C C C C C C C C C C H H H H H H H H H H H H H H H H H H
charge: -0.454310 -0.402731 -0.245879 -0.009363 -0.190216 -0.481749 -0.490167 -0.349565 -0.457083 -0.218968 -0.189648 0.468595 0.174202 -0.425834 -0.393575 -0.230099 -0.233016 -0.242763 0.243711 0.238921 0.205468 0.206855 0.219685 0.242472 0.283909 0.210569 0.214358 0.199750 0.203638 0.346318 0.233155 0.262289 0.227819 0.227087 0.376413 0.229754
chargesum: 0.00000
title: Mulliken charges with hydrogens summed into heavy atoms:
elementType: O O O C C C C C C C C C C C C C C C
charge: -0.107993 -0.026318 -0.245879 0.234348 0.048705 -0.069427 -0.028010 -0.065656 -0.032156 -0.019218 0.013990 0.468595 0.174202 -0.192678 -0.131286 -0.002280 -0.005929 -0.013010
polarizability: 1.55943077e+02 5.62973254e+00 1.68980882e+02 1.93570158e-01 1.86846001e+00 1.56701573e+02
1716.lowfreq: -14.5585 -7.8692 -0.0005 0.0004 0.0005 5.1500 29.2174 43.8240 53.1166
frequency: 29.0235 43.7985 53.1047 58.1961 72.9453 99.9793 124.7542 139.0555 181.6937 192.1706 233.2482 242.3216 259.6643 280.5109 311.4304 332.4578 389.1718 404.8268 437.4049 479.7032 494.4614 511.4686 559.5343 590.2247 616.8496 626.3703 644.2968 679.9074 703.1082 708.2228 738.8812 767.8219 798.9005 843.9494 856.2709 876.2133 894.6008 901.2038 923.0750 933.2763 946.8355 954.1531 973.7635 978.5620 990.1322 997.0568 1012.2925 1028.7357 1057.1879 1062.5097 1065.2045 1080.3832 1088.8781 1108.6517 1138.2296 1172.9006 1184.0540 1189.1396 1192.6072 1199.3500 1213.7426 1238.7807 1250.7131 1264.6897 1279.8596 1282.8352 1311.2082 1328.8602 1332.0048 1343.7030 1348.8955 1356.6996 1381.0733 1382.5055 1384.0337 1442.7446 1456.0300 1461.0233 1470.0287 1481.7433 1592.6179 1610.5387 1655.7718 1676.7126 2954.2375 2957.0436 2958.6747 2962.5000 2980.0819 3006.3209 3008.6277 3024.1814 3065.5579 3091.0899 3120.5530 3123.9088 3126.1993 3138.3233 3148.2300 3164.3163 3503.9904 3583.6766
redmass: 4.1543 4.5520 6.4635 3.3845 5.3143 4.4646 3.4153 4.7427 4.5169 2.0354 3.1878 1.4665 3.1875 5.4446 5.6283 4.9608 2.0190 2.8316 2.6555 3.7436 3.6541 3.2165 3.1252 4.1351 6.0174 1.7575 2.3546 1.6257 3.2206 1.8922 2.6164 1.9808 2.0181 4.4034 1.2534 2.9667 2.3236 2.8819 1.7891 1.8758 2.5481 2.5661 1.2047 1.3919 5.5091 1.3527 2.8053 2.1523 2.3083 1.7573 2.1444 1.6853 1.9068 2.1810 1.1612 1.0661 1.3429 1.1631 1.2190 1.5689 1.4961 1.4866 1.3598 1.4646 1.2956 1.2951 1.4031 1.4036 1.4615 1.4904 1.5924 1.7184 1.7150 1.5586 3.8335 2.1521 1.0986 1.0779 1.0924 2.2566 6.0671 6.0339 8.2466 6.3562 1.0599 1.0655 1.0637 1.0780 1.0838 1.0957 1.0976 1.1019 1.0843 1.0838 1.0861 1.0993 1.0870 1.0918 1.0963 1.1015 1.0638 1.0662
irintensity: 0.3120 0.0515 3.3808 0.1724 1.1450 0.9699 2.1578 0.8401 10.9791 5.7444 20.5399 118.5473 6.8684 1.1840 6.0497 3.0942 0.0196 0.0434 5.1362 5.4331 2.8270 3.9521 20.4081 67.7874 3.3969 152.0537 3.1428 26.3428 52.4137 51.0433 8.6862 31.9416 0.2807 14.4651 0.0576 1.3955 6.5242 6.8269 4.1200 3.9919 19.3401 18.7632 0.0545 0.2378 3.7102 2.6495 101.9095 28.3210 41.5301 6.7517 177.8388 7.3564 1.2610 2.4084 10.0446 0.0998 5.7560 3.7386 4.1399 10.1950 25.5620 0.9466 5.7070 28.6796 12.6059 3.3213 5.1592 4.4683 0.3254 0.4651 19.5680 45.6636 6.6614 6.2560 13.7676 10.0654 1.7651 16.0395 3.2229 20.3708 2.2845 8.6770 176.4259 5.9452 31.6795 32.9885 22.8587 20.4008 8.7571 55.8672 3.5574 78.9357 5.8523 8.5670 7.2235 65.4542 0.3513 15.8435 27.0538 22.3399 22.3820 6.3383
temp: 298.150 k
press: 1.00000 atm
elementType: 8 8 8 6 6 6 6 6 6 6 6 6 6 6 6 6 6 6 1 1 1 1 1 1 1 1 1 1 1 1 1 1 1 1 1 1
symmnumber: 1
zpe: 777088.5 jmol-1
zpe.correction: 0.295977 hartree
zpe.thermalcorrener: 0.313091 hartree
zpe.thermalcorrenthalpy: 0.314036 hartree
zpe.thermalcorrgfe: 0.249926 hartree
zpe.sumelectzpe: -806.715218 hartree
zpe.sumelectthermal: -806.698104 hartree
zpe.sumelectthermalent: -806.697160 hartree
zpe.sumelectthermalfe: -806.761270 hartree
dipole: -0.8943 1.3820 -0.3756
dipole: 1.6884
quadrupole: -103.1198 -102.9680 -103.3472
quadrupole: 3.3850 5.1614 0.0941
quadrupole: 0.0252 0.1770 -0.2022 3.3850 5.1614 0.0941
hfenergy: -807.0111954 hartree
pointgroup: C01 [X(C15H18O3)]
dipole: 0.2848748 -0.5961568 -0.0686528 debye
polarizability: 157.5088022|6.9524578|166.8114272|-1.3063942|-3.0405446|157.3053035 unknown
InChI: InChI=1S/C15H18O3/c16-14(12-9-5-2-6-10-12)13(15(17)18)11-7-3-1-4-8-11/h1-5,7-8,12-14,16-17H,6,9-10H2
charge 0 multiplicity 1
36 atoms
O  1.220244 2.457515 -0.279552
O  -2.114396 2.986846 0.798793
O  -1.812192 2.543895 -1.457226
C  1.617009 -0.018859 -0.262006
C  0.632758 1.132598 -0.585109
C  2.868194 0.060525 -1.175327
C  2.042895 -0.044287 1.227092
C  -0.683636 1.120386 0.234888
C  3.780903 -1.172952 -0.983096
C  3.242581 -0.940022 1.477135
C  4.013106 -1.466637 0.489043
C  -1.450007 -0.20319 0.125303
C  -1.561291 2.267532 -0.262938
C  -1.667019 -0.995774 1.279243
C  -1.945146 -0.658266 -1.124873
C  -2.350763 -2.229161 1.188301
C  -2.628534 -1.890764 -1.216162
C  -2.830082 -2.683006 -0.061651
H  1.094982 -0.969872 -0.495711
H  0.369552 1.087224 -1.664408
H  3.451777 0.970007 -0.921863
H  2.56146 0.14469 -2.237708
H  1.199332 -0.397823 1.853406
H  2.262812 0.991197 1.562478
H  -0.441683 1.324475 1.290912
H  4.752661 -1.008083 -1.48984
H  3.328878 -2.060129 -1.475869
H  3.477001 -1.170726 2.526148
H  4.849295 -2.131424 0.746601
H  1.919678 2.662214 -0.948489
H  -1.307151 -0.642599 2.253245
H  -1.816989 -0.035092 -2.01744
H  -2.51113 -2.830973 2.089808
H  -3.008889 -2.230738 -2.186095
H  -2.69295 3.712035 0.435651
H  -3.361358 -3.638565 -0.134384
