program: Gaussian 09
title: 000226132
version: EM64L-G09RevD.01
frameworkgroup: C1[X(C13H19NO)]
method: RPBEPBE
basis: SDD
operation: Freq
keyword: #p
keyword: freq=noraman
keyword: PBEPBE/SDD
title: #p freq=noraman PBEPBE/SDD
converged: YES YES NO NO
title: Mulliken charges:
elementType: O N C C C C C C C C C C C C C H H H H H H H H H H H H H H H H H H H
charge: -0.258569 -0.456694 -0.165687 -0.049967 -0.420792 -0.715577 -0.730355 0.177351 -0.710668 0.478033 -0.453022 -0.350103 -0.197741 -0.215093 -0.255774 0.189826 0.199214 0.246116 0.198335 0.200072 0.250224 0.226200 0.221309 0.196711 0.234172 0.235539 0.219318 0.199768 0.300292 0.218792 0.308116 0.225695 0.226397 0.228562
chargesum: 0.00000
title: Mulliken charges with hydrogens summed into heavy atoms:
elementType: O N C C C C C C C C C C C C C
charge: -0.258569 -0.156402 0.024138 0.149246 0.023659 -0.039081 -0.078163 0.177351 -0.056043 0.478033 -0.234230 -0.041987 0.027955 0.011305 -0.027211
polarizability: 2.09410781e+02 -4.33163935e+00 1.10535908e+02 -2.53332023e+00 9.81101907e+00 1.38420079e+02
1716.lowfreq: -16.7223 -12.4509 -0.0008 -0.0003 0.0008 1.7936 17.4949 37.6752 51.7873
frequency: 15.1210 37.5503 51.3244 82.3326 92.3719 116.0451 152.6637 169.2421 202.7416 217.7023 241.4687 263.2221 277.4876 293.6825 319.9463 340.5288 384.7331 406.9453 434.9965 465.1011 517.6060 583.5569 613.3332 652.9417 659.6609 697.0425 729.1976 769.7147 791.1395 805.8736 834.9300 842.9242 893.3166 916.3910 917.7872 930.8248 956.1697 968.1459 972.4935 984.4707 1000.5448 1025.3549 1038.8803 1066.6863 1087.0032 1095.6234 1113.7095 1146.5751 1171.6676 1173.0546 1184.7244 1186.4044 1249.3221 1258.2918 1263.8305 1290.4829 1313.1441 1319.3216 1333.4752 1367.9841 1380.4253 1387.0418 1390.9653 1398.0798 1425.5252 1459.4397 1466.7102 1468.4723 1477.8912 1481.7850 1484.0381 1484.5438 1488.4167 1507.0761 1597.1173 1612.6793 1617.6283 2934.1897 2957.6625 2965.9833 2973.2998 2984.3639 2985.5556 3046.2443 3056.9573 3070.9088 3072.5579 3075.8482 3077.2735 3090.8613 3107.8549 3131.2504 3143.3960 3164.6264 3195.5370 3527.8616
redmass: 3.6460 3.7451 2.6836 2.4877 4.7032 3.6321 3.7910 2.5158 1.0823 1.4416 1.0913 3.4821 3.0505 2.7760 2.4724 6.0696 2.7243 2.9169 2.9427 2.9806 2.7699 5.3785 6.3415 1.1689 3.1047 1.9768 2.9908 1.7234 3.5681 1.6622 3.4898 1.2728 2.4461 1.1764 1.4348 2.4805 1.4498 2.1109 1.3530 6.1387 1.3076 2.1653 1.9131 1.5994 1.5582 2.3242 1.7758 2.6379 1.0824 2.2595 2.1220 1.1268 1.2758 1.8347 1.3752 1.3270 1.4790 1.4604 1.4200 1.6483 1.2526 2.6241 1.3709 1.2274 2.3472 1.0706 1.0636 1.0531 1.0506 1.1556 1.0999 1.7797 1.0517 2.1157 6.8965 4.3942 5.1965 1.0824 1.0814 1.0390 1.0361 1.0481 1.0515 1.0976 1.0983 1.0997 1.0993 1.0989 1.1000 1.0996 1.0885 1.0867 1.0934 1.0999 1.0951 1.0761
irintensity: 1.2180 0.2947 0.1472 1.6523 2.2986 0.6478 1.8475 3.1349 0.2207 3.8455 0.0529 0.5369 0.2854 6.9881 0.0086 2.5232 1.7547 0.0219 4.6777 3.1319 19.7618 6.4381 0.7141 38.5852 0.7440 52.8663 1.7152 93.7108 4.5268 14.4397 7.2160 0.1781 5.3936 3.2059 13.1013 0.3992 0.0604 2.7883 0.2384 0.2674 2.9797 5.4978 0.3028 7.9876 15.5406 3.1699 17.3068 8.4815 2.2715 58.2234 24.0994 1.2328 11.9006 11.2867 21.5661 12.2464 63.8291 5.5283 2.7521 13.8701 37.6988 33.6626 15.0466 24.0987 91.8320 11.9296 2.2723 3.8317 9.2216 14.1236 13.5427 57.7337 11.7174 329.9947 67.0009 56.5328 46.6183 31.0743 35.3998 34.4915 35.4852 9.3112 63.1896 1.5124 36.3064 20.0966 34.9730 57.9069 74.2251 38.6424 15.3061 0.4726 31.3290 25.9354 7.5954 8.9463
temp: 298.150 k
press: 1.00000 atm
elementType: 8 7 6 6 6 6 6 6 6 6 6 6 6 6 6 1 1 1 1 1 1 1 1 1 1 1 1 1 1 1 1 1 1 1
symmnumber: 1
zpe: 765483.7 jmol-1
zpe.correction: 0.291557 hartree
zpe.thermalcorrener: 0.307570 hartree
zpe.thermalcorrenthalpy: 0.308515 hartree
zpe.thermalcorrgfe: 0.246743 hartree
zpe.sumelectzpe: -635.634445 hartree
zpe.sumelectthermal: -635.618432 hartree
zpe.sumelectthermalent: -635.617488 hartree
zpe.sumelectthermalfe: -635.679259 hartree
dipole: -0.3517 -0.9451 -3.2452
dipole: 3.3983
quadrupole: -82.8506 -95.0151 -88.9328
quadrupole: 0.0555 2.1969 1.0090
quadrupole: 6.0823 -6.0823 0.0000 0.0555 2.1969 1.0090
hfenergy: -635.9260021 hartree
pointgroup: C01 [X(C13H19N1O1)]
dipole: -0.124791 -0.5871489 -1.19466 debye
polarizability: 209.5844068|-0.3836746|114.3571882|-3.1332722|13.7986931|134.4251728 unknown
InChI: InChI=1S/C13H19NO/c1-4-12(10(2)3)13(15)14-11-8-6-5-7-9-11/h5-10,12,14H,4H2,1-3H3
charge 0 multiplicity 1
34 atoms
O  -0.797708 0.759825 1.348454
N  0.239846 -0.084752 -0.578645
C  -2.231584 -0.029248 -0.494254
C  -2.87975 -1.357165 0.045763
C  -3.169995 1.194907 -0.331383
C  -3.248122 -1.298241 1.547129
C  -1.993952 -2.590896 -0.25278
C  -0.878978 0.258283 0.185392
C  -2.72097 2.418421 -1.158117
C  1.62302 0.025144 -0.252671
C  2.559175 -0.418822 -1.226959
C  2.090419 0.553233 0.981314
C  3.943052 -0.337178 -0.974825
C  3.480502 0.627636 1.217387
C  4.414278 0.187445 0.251673
H  -2.05888 -0.185202 -1.58275
H  -3.822888 -1.471146 -0.531264
H  -3.205896 1.468343 0.73881
H  -4.194193 0.894665 -0.630432
H  -3.710142 -2.25312 1.86031
H  -2.354139 -1.12174 2.170203
H  -3.967762 -0.488862 1.761447
H  -2.52376 -3.521897 0.019953
H  -1.733292 -2.657641 -1.32743
H  -1.053047 -2.561701 0.327634
H  -1.720516 2.767031 -0.842139
H  -3.42256 3.262273 -1.027518
H  -2.676238 2.181913 -2.238737
H  0.039044 -0.481561 -1.499636
H  2.20192 -0.827731 -2.181513
H  1.367139 0.893228 1.72415
H  4.651966 -0.683101 -1.735235
H  3.834114 1.036449 2.170725
H  5.489595 0.251209 0.449046
