program: Gaussian 09
title: 000000791
version: EM64L-G09RevD.01
frameworkgroup: C1[X(C6H13NO2)]
method: RPBEPBE
basis: SDD
operation: Freq
keyword: #p
keyword: freq=noraman
keyword: PBEPBE/SDD
title: #p freq=noraman PBEPBE/SDD
converged: YES YES NO NO
title: Mulliken charges:
elementType: O O N C C C C C C H H H H H H H H H H H H H
charge: -0.415599 -0.234905 -0.582015 -0.004877 -0.214714 -0.366943 -0.757603 -0.713550 0.128578 0.215614 0.257176 0.193572 0.235160 0.218253 0.224221 0.229971 0.211363 0.218230 0.211835 0.289616 0.279307 0.377312
chargesum: 0.00000
title: Mulliken charges with hydrogens summed into heavy atoms:
elementType: O O N C C C C C C
charge: -0.038287 -0.234905 -0.013092 0.210737 0.042461 0.061789 -0.085158 -0.072122 0.128578
polarizability: 8.78356919e+01 2.22200997e+00 7.66390770e+01 1.51584587e+00 -2.57470430e+00 7.04452834e+01
1716.lowfreq: 0.0007 0.0007 0.0009 4.2851 8.2764 15.6950 35.9824 61.0751 81.8339
frequency: 35.9219 61.0712 81.8106 157.0634 181.4150 196.8638 209.9408 250.3980 258.4371 288.4545 360.6812 394.3523 436.6015 551.5701 581.9999 624.2278 672.4474 684.7559 764.9088 814.6563 840.9897 907.0107 963.4415 1010.3382 1021.6450 1033.2638 1060.9304 1081.3236 1154.0257 1173.9401 1195.9093 1226.2403 1263.5522 1278.0358 1298.1182 1335.1671 1349.2673 1369.1739 1387.6625 1388.4189 1458.7789 1473.5174 1475.9820 1484.8071 1490.5631 1650.7861 1654.1330 2972.3459 2974.9034 2979.0407 2989.0074 3035.3612 3036.2291 3066.9684 3070.0346 3071.2047 3074.9137 3458.7386 3500.9246 3576.8610
redmass: 3.4230 5.4446 2.1113 3.0744 1.1104 2.3100 1.2987 1.2050 3.0191 2.7371 2.6799 3.2467 3.2356 2.1432 2.3006 1.9933 2.2854 1.6604 1.6192 1.9455 2.5615 2.7233 1.2289 1.5838 2.1910 2.5190 1.7505 1.9462 1.8599 2.0775 2.2736 1.3034 1.2671 1.7626 1.3007 1.3327 1.5574 1.3937 1.2128 1.2126 1.0724 1.0493 1.0492 1.0469 1.0525 8.6080 1.0892 1.0359 1.0415 1.0560 1.0834 1.0948 1.0880 1.1000 1.0996 1.0989 1.0990 1.0454 1.0641 1.0965
irintensity: 0.4800 0.4559 0.4834 0.4571 34.2016 3.0326 0.5621 6.5258 4.3703 14.1463 3.8072 21.5811 10.3477 45.8870 25.1287 50.5574 49.8184 239.2619 7.4595 3.2127 13.3257 11.0865 11.9949 21.8168 35.0958 196.2133 5.7558 14.7613 2.7363 1.7307 0.7009 13.2280 2.8651 23.8879 4.3441 1.5001 1.0582 1.0337 14.0113 21.5578 4.9732 7.5350 17.1063 11.0678 9.5186 220.5282 44.4781 37.5679 11.5382 44.5461 12.5524 3.1661 13.1492 42.6142 1.2268 77.6585 62.7776 1.5154 12.0983 4.8553
temp: 298.150 k
press: 1.00000 atm
elementType: 8 8 7 6 6 6 6 6 6 1 1 1 1 1 1 1 1 1 1 1 1 1
symmnumber: 1
zpe: 493107.5 jmol-1
zpe.correction: 0.187815 hartree
zpe.thermalcorrener: 0.199177 hartree
zpe.thermalcorrenthalpy: 0.200121 hartree
zpe.thermalcorrgfe: 0.150524 hartree
zpe.sumelectzpe: -440.894972 hartree
zpe.sumelectthermal: -440.883610 hartree
zpe.sumelectthermalent: -440.882666 hartree
zpe.sumelectthermalfe: -440.932263 hartree
dipole: 0.2288 1.0366 -0.1328
dipole: 1.0698
quadrupole: -58.8188 -56.0484 -51.9074
quadrupole: -4.0699 0.2946 -0.1952
quadrupole: -3.2273 -0.4569 3.6842 -4.0699 0.2946 -0.1952
hfenergy: -441.082787 hartree
pointgroup: C01 [X(C6H13N1O2)]
dipole: -0.0946911 -0.3886974 0.1307866 debye
dipolederiv: -0.305122 0.1609468 -0.0465375 0.1143178 -1.2325985 0.010085 -0.0365698 -0.0362161 -0.3748795 -0.9119154 -0.2785134 0.0761794 -0.0579194 -0.724271 -0.0033753 0.169122 0.0733672 -0.318538 -0.605019 0.1545278 0.0193006 0.1274441 -0.6021313 -0.2192623 -0.0209577 -0.14152 -0.2810005 0.1290912 -0.0082171 0.0225719 0.0739042 0.0770398 0.0209128 0.1870812 -0.0574953 0.1187219 -0.0769314 0.0666666 0.0277718 -0.0546061 0.4394227 0.2111865 -0.0351356 0.1674146 0.20471 0.0567147 0.0300504 0.0226144 -0.0198423 0.0710445 0.0231614 -0.0862541 0.0294267 0.0656593 -0.0317177 -0.0478651 0.0244831 -0.0310457 0.0357857 0.0393624 -0.0001421 0.0877078 -0.0645283 -0.0138248 -0.043512 0.0682038 -0.0247484 0.0420751 0.0594959 0.0830143 0.0723169 0.0186533 1.1325499 0.1160791 -0.1144983 -0.0749305 1.4195016 -0.0580025 -0.3090964 -0.0641296 0.134995 0.0469337 0.002503 0.0026989 0.017488 -0.1491959 -0.0498796 0.0044247 -0.0334394 0.0180132 0.1310259 -0.0129032 0.0427586 0.0083362 -0.0192969 0.0543353 0.0495599 0.0717543 -0.0569082 -0.0775976 0.0056116 -0.1048247 -0.010228 0.0677808 0.0227897 -0.1180743 0.0328334 -0.128377 0.1050126 -0.01149 0.0275935 0.0400534 -0.1072754 -0.0413257 0.0674558 -0.0413397 0.0463223 0.001788 -0.0246375 -0.1491313 -0.0354824 0.0750099 -0.0428289 -0.1184852 -0.0170569 -0.0812337 0.085669 0.0364086 0.011129 0.023637 -0.1302374 -0.0117088 0.0294023 -0.0852643 0.0845675 -0.1428237 0.006895 0.1098767 0.0201587 0.0675561 0.0030832 0.0803851 0.0084806 0.0644792 0.0957085 0.0427756 0.0176284 -0.0144346 -0.1496865 -0.0560921 0.006893 -0.1059996 0.0326826 -0.1989845 0.0059046 0.0901616 0.0348624 0.0775698 0.0044892 0.0641928 0.0085649 0.0686373 0.0276606 0.0086442 -0.1517473 -0.0152712 0.0637852 0.0006885 -0.1211647 0.0176939 -0.1188343 0.2354549 -0.1571615 0.0837567 -0.0611448 0.2047928 0.0047071 0.0842722 0.0297117 0.1422703 0.2312253 -0.0984426 -0.1690076 -0.0318488 0.1696054 0.0385454 -0.0814846 0.0018093 0.0711411 0.0851017 0.045729 0.0890183 -0.0286999 0.3037234 -0.0103673 0.1015612 -0.0186204 0.3534464 unknown
polarizability: 87.7998536|1.1558972|77.4450535|-2.6317098|-0.7819322|69.6751452 unknown
InChI: InChI=1S/C6H13NO2/c1-3-4(2)5(7)6(8)9/h4-5,8H,3,7H2,1-2H3
charge 0 multiplicity 1
22 atoms
O  1.653315 -1.771863 0.096377
O  2.614256 0.331595 -0.111365
N  0.237654 1.541566 0.989196
C  -0.778726 -0.082502 -0.64991
C  0.217108 0.142772 0.547772
C  -2.240167 0.159904 -0.191774
C  -0.424257 0.81957 -1.855244
C  -2.787772 -0.896112 0.792718
C  1.612332 -0.370228 0.154185
H  -0.67392 -1.144852 -0.951445
H  -0.132155 -0.490568 1.383266
H  -2.882068 0.176076 -1.095746
H  -2.292826 1.167672 0.262883
H  -1.072078 0.57643 -2.716781
H  -0.588301 1.884874 -1.60754
H  0.626182 0.697594 -2.179022
H  -2.711938 -1.916186 0.370335
H  -3.851772 -0.704178 1.023336
H  -2.241819 -0.888528 1.754577
H  0.779837 2.148185 0.364128
H  0.531619 1.664209 1.962956
H  2.561894 -2.065531 -0.187503
