program: Gaussian 09
title: 000226128
version: EM64L-G09RevD.01
frameworkgroup: C1[X(C11H16N2O2)]
method: RPBEPBE
basis: SDD
operation: Freq
keyword: #p
keyword: freq=noraman
keyword: PBEPBE/SDD
title: #p freq=noraman PBEPBE/SDD
converged: YES YES NO NO
title: Mulliken charges:
elementType: O O N N C C C C C C C C C C C H H H H H H H H H H H H H H H H
charge: -0.516341 -0.265425 -0.361899 -0.512854 0.246031 -0.320511 0.466755 -0.715493 -0.724508 0.127528 -0.431138 -0.387303 -0.225303 -0.229444 -0.247393 0.224553 0.221730 0.204342 0.250052 0.264713 0.199841 0.220938 0.351880 0.234488 0.274213 0.375796 0.224683 0.222307 0.226928 0.300507 0.300327
chargesum: 0.00000
title: Mulliken charges with hydrogens summed into heavy atoms:
elementType: O O N N C C C C C C C C C C C
charge: -0.164461 -0.265425 0.013897 0.087980 0.246031 -0.095958 0.466755 -0.039370 -0.039015 0.127528 -0.196650 -0.113089 -0.000621 -0.007137 -0.020464
polarizability: 1.63113578e+02 4.07811285e+00 1.13237705e+02 4.19932002e-01 -1.09128851e+00 1.31617320e+02
1716.lowfreq: -14.3885 -9.1793 -1.4631 -0.0007 -0.0006 -0.0005 22.4613 57.5697 63.8035
frequency: 22.2472 57.5655 63.7900 84.2114 97.3614 136.9634 166.3136 198.8183 211.0266 230.2434 247.2686 255.7060 277.7226 286.8337 306.3542 317.9778 352.5749 385.3198 403.0739 446.7803 488.8065 515.7766 610.6799 614.3388 679.2957 701.2775 714.7626 753.8033 773.8166 788.5816 801.8453 829.3778 855.0702 907.8751 917.2453 918.6552 923.3754 967.7728 977.9295 991.4441 994.9629 998.4357 1029.5864 1077.1639 1101.2638 1132.1424 1148.7855 1171.3901 1189.9092 1192.8118 1199.4801 1245.9062 1268.6206 1285.7214 1291.0078 1319.0941 1345.0401 1378.8669 1383.3260 1397.9386 1441.2414 1457.2912 1460.6780 1473.7821 1477.4510 1482.2137 1487.9077 1590.4176 1603.4835 1613.8522 1677.8469 2978.1465 2981.9464 3028.4981 3066.9239 3074.8652 3094.3131 3104.9196 3119.8920 3126.7368 3140.8358 3158.3276 3172.5028 3374.1594 3428.1509 3488.3982 3570.6551
redmass: 3.8623 5.4459 5.6722 3.3479 1.9094 1.8716 3.6723 1.2415 2.0748 1.6145 3.5506 2.1139 1.3350 2.7275 2.6066 3.8328 6.1960 2.5450 2.8101 3.7826 3.2584 3.3740 4.6898 6.3692 5.7814 2.0729 2.2115 4.2856 1.3805 1.7558 2.0622 3.7727 1.2507 2.2330 1.5147 3.0699 1.5766 2.5618 1.4293 5.0901 1.3193 1.3810 2.1864 1.5875 1.5991 2.3689 2.1867 1.0656 3.2679 1.1407 1.9964 2.6555 1.6842 1.1919 1.6417 1.7437 1.3987 1.2665 4.8096 1.2147 2.0838 1.0560 1.0614 1.0579 1.7026 1.4180 1.3797 6.0014 6.5783 6.1012 1.0638 1.0374 1.0375 1.0836 1.0980 1.0975 1.0998 1.0990 1.0852 1.0884 1.0938 1.0982 1.0966 1.0440 1.0821 1.0976 1.0661
irintensity: 0.8395 0.4349 10.1299 1.4725 13.4042 14.3431 3.2530 2.3980 6.7279 16.6373 7.6666 5.3515 67.1142 19.2843 23.2516 11.2745 9.5174 5.4969 0.3426 13.6697 3.5186 18.1525 9.7611 0.2779 9.2710 36.3915 30.3493 73.5828 121.5871 75.5971 40.6640 10.8320 2.7091 12.2521 3.1720 15.5364 3.1992 4.4547 0.6977 0.3549 0.8777 2.4164 7.0434 3.2089 89.3822 4.5304 13.7887 0.4219 10.2973 0.4813 3.4931 61.8582 9.6697 0.6389 5.3713 24.4562 17.7220 22.7449 1.7366 22.0639 9.0927 2.6596 2.2810 7.5384 76.7520 26.4867 110.2743 2.7334 132.6875 76.1838 20.4911 11.2447 38.5546 8.2591 2.7605 51.0554 18.7038 17.0737 3.5106 3.8643 32.6262 29.3745 7.6027 4.9652 155.1199 1.1588 5.3113
temp: 298.150 k
press: 1.00000 atm
elementType: 8 8 7 7 6 6 6 6 6 6 6 6 6 6 6 1 1 1 1 1 1 1 1 1 1 1 1 1 1 1 1
symmnumber: 1
zpe: 670547.4 jmol-1
zpe.correction: 0.255398 hartree
zpe.thermalcorrener: 0.271383 hartree
zpe.thermalcorrenthalpy: 0.272327 hartree
zpe.thermalcorrgfe: 0.211839 hartree
zpe.sumelectzpe: -687.562306 hartree
zpe.sumelectthermal: -687.546321 hartree
zpe.sumelectthermalent: -687.545377 hartree
zpe.sumelectthermalfe: -687.605866 hartree
dipole: 0.2957 3.8003 1.3870
dipole: 4.0562
quadrupole: -83.7932 -86.3969 -90.0591
quadrupole: 7.5062 1.0032 -2.5609
quadrupole: 2.9565 0.3528 -3.3094 7.5062 1.0032 -2.5609
hfenergy: -687.8177042 hartree
pointgroup: C01 [X(C11H16N2O2)]
dipole: 0.0595483 1.3214197 0.8927742 debye
polarizability: 162.7291682|3.4114289|114.635848|4.2871513|-4.9214278|130.6035866 unknown
InChI: InChI=1S/C11H16N2O2/c1-11(2,15)9(10(14)13-12)8-6-4-3-5-7-8/h3-7,9,13,15H,12H2,1-2H3
charge 0 multiplicity 1
31 atoms
O  1.258687 0.766182 1.521256
O  1.475377 -1.478458 -2.132943
N  1.804202 -1.528301 0.169165
N  2.489544 -2.779641 0.164981
C  1.219686 1.42527 0.171657
C  0.573473 0.404371 -0.823308
C  -0.919926 0.115251 -0.614694
C  2.668598 1.754807 -0.255405
C  0.37108 2.708676 0.2787
C  1.33336 -0.942598 -0.990202
C  -1.801763 0.243064 -1.718328
C  -1.447192 -0.322871 0.629292
C  -3.178298 -0.048138 -1.586978
C  -2.823936 -0.609746 0.762495
C  -3.695969 -0.474565 -0.343041
H  0.677173 0.874873 -1.818645
H  2.686842 2.237983 -1.248942
H  3.135453 2.453096 0.465167
H  3.286008 0.841667 -0.302947
H  -0.631025 2.481509 0.677202
H  0.861717 3.444003 0.94541
H  0.249741 3.184211 -0.711427
H  1.623881 1.410041 2.178295
H  -1.404507 0.559866 -2.690168
H  -0.779326 -0.423811 1.489149
H  1.763835 -1.004895 1.053909
H  -3.84181 0.054069 -2.453143
H  -3.216276 -0.943891 1.73007
H  -4.762597 -0.70284 -0.237431
H  1.819406 -3.544164 -0.009953
H  3.205359 -2.777721 -0.57789
