program: Gaussian 09
title: 000226140
version: EM64L-G09RevD.01
frameworkgroup: C1[X(C14H14O3S)]
method: RPBEPBE
basis: SDD
operation: Freq
keyword: #p
keyword: freq=noraman
keyword: PBEPBE/SDD
title: #p freq=noraman PBEPBE/SDD
converged: YES YES NO NO
title: Mulliken charges:
elementType: S O O O C C C C C C C C C C C C C C H H H H H H H H H H H H H H
charge: 0.217235 -0.442152 -0.388294 -0.264833 0.193350 -0.411856 -0.111415 0.511158 -0.716350 0.194009 -0.311140 -0.445071 -0.349445 -0.128709 -0.509165 -0.224981 -0.238749 -0.242874 0.255705 0.253166 0.245427 0.206643 0.363710 0.282568 0.232949 0.253489 0.243686 0.262574 0.227712 0.227606 0.230197 0.383849
chargesum: 0.00000
title: Mulliken charges with hydrogens summed into heavy atoms:
elementType: S O O O C C C C C C C C C C C C C C
charge: 0.217235 -0.078442 -0.004445 -0.264833 0.193350 -0.156150 -0.111415 0.511158 -0.011114 0.194009 -0.028572 -0.212122 -0.095956 0.114976 -0.246591 0.002731 -0.011143 -0.012677
polarizability: 2.31391460e+02 1.60619571e+01 1.11803916e+02 4.03511223e+00 -4.00042444e+00 1.65682572e+02
1716.lowfreq: -9.5761 -3.9684 -0.0015 -0.0008 0.0014 7.0562 23.5319 34.6480 45.3840
frequency: 23.4342 34.0895 45.3515 65.5020 68.4590 89.7074 152.7794 169.5800 185.5111 207.3922 241.2073 259.8863 286.8284 300.3589 323.7406 343.5314 398.8110 404.1072 454.6342 488.4626 515.0443 525.6310 581.5148 595.0226 610.3570 618.6727 629.1740 635.1717 685.7535 695.0893 698.3879 705.8051 729.2970 777.1467 808.6932 815.4194 847.9523 849.0089 877.9487 893.5888 909.0346 918.8730 949.6392 973.3746 989.2896 991.3045 995.6009 1028.2069 1047.5886 1059.6598 1075.4528 1085.3786 1090.9169 1131.8403 1171.2697 1173.0892 1194.2414 1197.7577 1219.1178 1228.0160 1277.7706 1327.2870 1338.9987 1345.1148 1372.1128 1383.4740 1385.9305 1442.5094 1452.5339 1470.0266 1479.4245 1480.9013 1546.9556 1591.8861 1607.3846 1623.2803 3000.4007 3042.5993 3102.4276 3115.9492 3120.8878 3130.5913 3144.0192 3160.0825 3173.1532 3173.7542 3196.1740 3236.3306 3361.4412 3502.0969
redmass: 4.0264 6.9399 5.6183 6.4132 5.7881 7.6511 4.8441 4.9330 2.8007 1.3848 3.4898 5.3259 3.3570 5.6834 6.3213 5.5378 4.7000 3.1778 4.0356 3.3142 3.7186 3.8283 3.1436 4.4109 2.7224 2.5420 2.0633 1.7352 6.6698 1.2243 2.0917 2.5712 3.1690 2.3491 5.2592 4.5010 1.2641 1.2553 3.8230 3.3455 1.6217 1.3797 2.6193 1.4046 2.5819 4.3892 1.3342 2.2513 1.8511 2.0804 2.1035 1.6152 1.2191 2.3784 2.5275 1.0628 1.4118 1.6479 1.4694 1.5006 1.5957 2.2614 1.5129 1.7092 1.4344 2.8478 1.6180 2.1018 1.0699 1.0767 4.9161 2.3788 6.1059 6.0259 6.0013 7.3451 1.0353 1.0836 1.0994 1.1009 1.0865 1.0877 1.0933 1.0975 1.0899 1.0977 1.0969 1.1005 1.0655 1.0638
irintensity: 0.1648 0.8923 0.2331 1.5827 0.4202 0.1516 0.2964 2.2642 0.7991 0.5632 0.5897 0.1336 0.9556 1.1471 9.8998 8.1905 1.8577 0.8425 2.7884 3.7438 6.6859 21.6596 22.0972 63.9464 32.2280 50.5333 16.6898 252.8910 5.0614 92.6354 38.7891 56.8897 34.0402 16.3941 9.9322 8.3940 5.7388 9.7704 8.6123 2.7533 2.4403 3.5102 5.1443 0.1137 3.8066 0.4642 0.2685 6.4439 18.9649 160.8171 122.1786 6.1389 30.0474 41.6580 8.2865 0.1852 2.4624 0.4536 54.2944 9.5263 36.4020 6.5294 27.9849 54.9237 60.9578 10.1491 29.2690 9.7166 3.7650 11.2181 2.5838 23.8613 0.7434 3.6198 20.2949 129.7359 10.7822 6.2999 13.1655 23.0595 4.6182 1.7382 27.9626 30.0142 7.5676 7.5731 0.5887 1.1317 99.3155 28.9548
temp: 298.150 k
press: 1.00000 atm
elementType: 16 8 8 8 6 6 6 6 6 6 6 6 6 6 6 6 6 6 1 1 1 1 1 1 1 1 1 1 1 1 1 1
symmnumber: 1
zpe: 643909.1 jmol-1
zpe.correction: 0.245252 hartree
zpe.thermalcorrener: 0.262209 hartree
zpe.thermalcorrenthalpy: 0.263153 hartree
zpe.thermalcorrgfe: 0.199041 hartree
zpe.sumelectzpe: -1164.306924 hartree
zpe.sumelectthermal: -1164.289967 hartree
zpe.sumelectthermalent: -1164.289023 hartree
zpe.sumelectthermalfe: -1164.353135 hartree
dipole: -0.2440 1.1767 -1.4773
dipole: 1.9044
quadrupole: -97.3457 -111.1759 -111.7286
quadrupole: 2.6996 0.7757 0.9700
quadrupole: 9.4044 -4.4258 -4.9785 2.6996 0.7757 0.9700
hfenergy: -1164.5521764 hartree
pointgroup: C01 [X(C14H14O3S1)]
dipole: 0.1165929 0.1911269 0.7150079 debye
polarizability: 231.4133004|-15.9457911|117.308399|-4.8306092|-16.6549684|160.1562486 unknown
InChI: InChI=1S/C14H14O3S/c1-14(17,11-8-5-9-18-11)12(13(15)16)10-6-3-2-4-7-10/h2-9,12,15,17H,1H3
charge 0 multiplicity 1
32 atoms
S  -2.754827 -0.722305 1.489306
O  -0.496703 0.009253 -1.923769
O  0.027249 2.195655 1.770711
O  -0.312067 2.372258 -0.508783
C  -0.690918 -0.564448 -0.584639
C  0.236256 0.159584 0.481194
C  -2.162892 -0.406215 -0.201227
C  1.741502 -0.070177 0.285886
C  -0.315994 -2.053604 -0.713991
C  -0.051806 1.656865 0.494859
C  -3.226617 -0.103146 -1.035959
C  2.475684 -0.735942 1.299526
C  2.421546 0.37193 -0.8788
C  -4.512513 -0.102092 -0.377647
C  -4.446517 -0.412091 0.969336
C  3.861179 -0.968703 1.152461
C  3.806642 0.137866 -1.025314
C  4.531769 -0.532144 -0.012878
H  -0.032456 -0.226364 1.480087
H  0.725931 -2.152778 -1.058888
H  -0.9837 -2.525029 -1.453215
H  -0.432179 -2.578024 0.250781
H  -0.593287 1.00278 -1.831022
H  -3.079805 0.102818 -2.097874
H  1.961249 -1.072044 2.208098
H  1.866712 0.878201 -1.673654
H  -5.451684 0.122423 -0.889335
H  -5.245089 -0.479172 1.706107
H  4.414133 -1.486338 1.944141
H  4.320148 0.478948 -1.9312
H  5.606695 -0.709773 -0.129398
H  -0.13104 3.178807 1.731199
