program: Gaussian 09
title: 000226113
version: EM64L-G09RevD.01
frameworkgroup: C1[X(C7H14O2)]
method: RPBEPBE
basis: SDD
operation: Freq
keyword: #pfreq=noraman
keyword: PBEPBE/SDD
title: #p freq=noraman PBEPBE/SDD
converged: YES YES NO NO
title: Mulliken charges:
elementType: O O C C C C C C C H H H H H H H H H H H H H H
charge: -0.416417 -0.236400 0.009879 -0.040545 -0.525718 -0.760774 -0.724013 -0.732899 0.170625 0.219483 0.221634 0.247546 0.249876 0.226284 0.219377 0.211847 0.220457 0.203854 0.213860 0.213556 0.215474 0.218489 0.374525
chargesum: 0.00000
title: Mulliken charges with hydrogens summed into heavy atoms:
elementType: O O C C C C C C C
charge: -0.041892 -0.236400 0.229362 0.181089 -0.028296 -0.103266 -0.085843 -0.085379 0.170625
polarizability: 8.94146360e+01 1.75949491e+00 7.81731432e+01 -3.81262701e+00 2.99229843e+00 7.55971125e+01
1716.lowfreq: -28.1745 -15.9470 -10.9130 -0.0004 0.0006 0.0006 25.4539 40.4424 85.1121
frequency: 23.5245 40.2360 84.9287 147.4704 183.0985 207.6652 242.2713 259.0316 274.2778 320.0645 339.8051 388.6971 497.7757 508.2767 529.1730 599.1900 652.7580 731.0066 844.9336 884.4627 902.0090 913.6850 942.8623 954.7298 1011.7561 1026.1897 1047.6268 1122.7678 1138.4008 1150.3244 1186.9651 1207.8831 1248.5594 1286.4838 1306.4940 1334.3747 1351.3960 1364.1840 1376.5628 1386.1667 1396.8929 1435.7287 1465.2074 1467.7982 1478.2327 1484.0555 1487.2615 1489.1680 1665.0509 2970.3869 2972.1928 2973.5955 2978.3657 2984.8194 2986.8431 3054.7336 3061.9295 3063.6305 3065.2688 3071.1436 3072.2441 3080.4548 3505.1684
redmass: 5.7979 2.8811 2.9850 2.9847 1.0631 1.1160 1.1023 2.3863 2.6017 3.0253 3.1562 2.3599 2.4604 2.2169 2.4402 3.6911 1.3612 2.8089 2.6903 2.1526 1.9514 1.2208 1.6930 1.3992 1.6739 1.9692 1.9765 2.0699 1.9590 2.0752 1.8116 1.3859 1.4343 1.4839 1.4170 1.5288 1.3778 1.6539 1.2324 1.2291 1.2079 1.0878 1.0483 1.0481 1.0488 1.0520 1.0457 1.0589 8.2301 1.0355 1.0650 1.0502 1.0404 1.0661 1.0814 1.0949 1.0994 1.0993 1.0979 1.0990 1.0986 1.0985 1.0638
irintensity: 0.8212 0.4269 0.5377 2.0270 0.0873 0.3549 0.1113 0.2614 0.1537 0.7738 4.0281 3.2924 16.4399 24.5408 13.0689 11.6973 135.2273 4.1542 2.0560 19.8862 3.2172 1.2623 11.7419 4.4725 6.3626 64.2539 200.3762 5.7153 36.1115 8.7259 1.0598 0.9886 0.1739 16.2061 2.0835 21.9356 1.3026 30.0105 24.8219 15.1741 13.8468 28.2935 1.2588 19.4862 4.7598 9.3984 23.3151 1.7074 189.3778 38.4671 23.2191 23.5541 21.8395 15.4834 6.9980 2.3437 13.9935 48.3880 39.1795 57.0500 70.2539 40.6598 18.3376
temp: 298.150 k
press: 1.00000 atm
elementType: 8 8 6 6 6 6 6 6 6 1 1 1 1 1 1 1 1 1 1 1 1 1 1
symmnumber: 1
zpe: 521740.7 jmol-1
zpe.correction: 0.198721 hartree
zpe.thermalcorrener: 0.210048 hartree
zpe.thermalcorrenthalpy: 0.210992 hartree
zpe.thermalcorrgfe: 0.160810 hartree
zpe.sumelectzpe: -424.857439 hartree
zpe.sumelectthermal: -424.846112 hartree
zpe.sumelectthermalent: -424.845167 hartree
zpe.sumelectthermalfe: -424.895350 hartree
dipole: 0.1310 0.8919 0.9354
dipole: 1.2991
quadrupole: -52.4333 -56.4062 -60.3011
quadrupole: 0.7386 -1.5944 -3.4980
quadrupole: 3.9469 -0.0260 -3.9209 0.7386 -1.5944 -3.4980
hfenergy: -425.0561596 hartree
pointgroup: C01 [X(C7H14O2)]
dipole: -0.026005 -0.2340183 0.4536304 debye
dipolederiv: -1.0805513 -0.0178597 -0.458084 -0.1065418 -0.3802864 -0.1437996 -0.4340509 -0.1111383 -0.5533644 -0.6573911 -0.117938 0.0560576 -0.0192672 -0.4438727 0.2701808 -0.186455 0.168284 -0.8397818 0.1788029 0.0275944 -0.0196099 -0.0005512 0.1081736 0.0059631 0.037744 0.0489648 0.0468866 0.0789051 -0.0339326 0.0005462 -0.0255154 0.1088572 0.0128813 -0.0297738 0.0052965 0.1418428 -0.1586281 -0.1084704 0.0087911 -0.2019763 -0.1204674 0.1537598 0.0683236 0.1271291 0.0083957 -0.0451769 -0.0467345 0.0213364 -0.0333418 -0.0479778 0.0325246 -0.0071675 0.0103645 0.1021033 -0.0195617 0.0580255 -0.0578259 0.0779051 0.0514184 0.0003722 -0.0569882 -0.0084728 -0.0037636 0.0546081 0.0487491 -0.0019958 0.0571876 0.0332892 -0.0408073 0.0235635 -0.030958 -0.0968771 1.3903381 0.3005537 0.3093588 0.3717597 0.4842038 -0.3175773 0.4498114 -0.266472 1.1054756 0.0531634 -0.003474 0.0270898 0.0198774 0.0319945 -0.0048 0.0170785 -0.0316494 -0.1489912 -0.0651078 -0.1082392 0.0320683 -0.1212705 -0.0587465 0.0255311 0.0232432 0.0275638 0.0072117 0.0676331 -0.038875 0.013248 -0.0299931 0.1130337 -0.0489257 -0.0252352 -0.0205486 -0.082752 0.0184536 0.0566637 0.0197042 0.0929898 -0.0713472 -0.0112352 0.0309711 -0.0282612 0.0939502 -0.1636956 -0.0183415 -0.0675841 0.0142504 0.1126925 0.0200622 -0.0777842 0.0060085 0.0531184 0.0752599 -0.0142682 -0.0079551 -0.015301 0.0869054 -0.0184499 0.0314372 0.0361796 -0.1633383 0.052943 0.1179823 0.039371 0.0683837 -0.1499552 -0.0568736 0.0356805 -0.0722816 0.0584317 0.0671917 0.0013019 0.062873 0.0011135 0.0934159 -0.0531107 0.0172888 -0.0221363 -0.1708272 -0.0677499 -0.1039215 0.0116004 -0.1545623 -0.008704 0.0312183 0.0568666 0.0559422 0.0570836 0.0263165 0.0801009 -0.0074437 0.1232412 -0.1613921 -0.0092248 0.0048896 -0.0492522 0.0874045 -0.0810686 0.022907 -0.1439944 0.0338158 0.0907895 0.0567339 -0.1288506 0.0339736 -0.0357932 0.0524368 0.0841907 0.0381961 0.0924905 -0.1584268 -0.0761576 0.0212253 -0.0247102 0.0723042 -0.0573101 -0.1094966 0.0697551 -0.1344557 0.0003776 0.0662483 0.0299871 0.0227824 0.0487104 0.2801887 -0.076518 0.0544969 -0.1102386 0.2860248 0.1054858 0.0981949 0.1233917 0.2125701 unknown
polarizability: 89.9143218|2.1805389|76.2555094|2.2233004|-3.4575505|77.0150606 unknown
InChI: InChI=1S/C7H14O2/c1-5(2)6(3)4-7(8)9/h5-6,8H,4H2,1-3H3
charge 0 multiplicity 1
23 atoms
O  2.97803 0.162657 0.504744
O  1.798034 0.549138 -1.454012
C  -0.617053 -0.694565 -0.267911
C  -1.223825 0.717078 0.037161
C  0.801668 -0.861277 0.332315
C  -1.513168 -1.86775 0.195554
C  -2.459917 0.999552 -0.850468
C  -1.569795 0.93558 1.530755
C  1.849645 0.017645 -0.322863
H  -0.508977 -0.754969 -1.370349
H  -0.448198 1.458614 -0.246605
H  0.816721 -0.677919 1.421673
H  1.143364 -1.908839 0.199491
H  -2.537647 -1.776876 -0.206101
H  -1.585185 -1.916109 1.298127
H  -1.104062 -2.834269 -0.154457
H  -2.219239 0.868386 -1.921864
H  -3.301504 0.325555 -0.602485
H  -2.815082 2.037132 -0.707691
H  -0.705161 0.752983 2.1958
H  -1.898537 1.978026 1.698352
H  -2.394224 0.273117 1.854193
H  3.660214 0.710509 0.028139
