program: Gaussian 09
title: 000226112
version: EM64L-G09RevD.01
frameworkgroup: C1[X(C7H14BrNO)]
method: RPBEPBE
basis: SDD
operation: Freq
keyword: #p
keyword: freq=noraman
keyword: PBEPBE/SDD
title: #p freq=noraman PBEPBE/SDD
converged: YES YES NO NO
title: Mulliken charges:
elementType: Br O N C C C C C C C H H H H H H H H H H H H H H
charge: -0.050447 -0.293772 -0.125386 -0.377516 -0.345050 0.250573 -0.447906 -0.643472 -0.659946 -0.674793 0.223798 0.237478 0.203144 0.260648 0.255108 0.252059 0.223686 0.220119 0.222123 0.251003 0.204236 0.219025 0.293194 0.302094
chargesum: 0.00000
title: Mulliken charges with hydrogens summed into heavy atoms:
elementType: Br O N C C C C C C C
charge: -0.050447 -0.293772 -0.125386 0.083760 0.118743 0.250573 0.059261 0.022456 0.014318 -0.079506
polarizability: 1.34560771e+02 4.36432894e+00 9.67860732e+01 2.00111538e+00 5.76603551e+00 7.18404339e+01
1716.lowfreq: -3.4633 0.0005 0.0005 0.0007 3.9707 7.2413 40.5388 53.1039 73.2166
frequency: 40.4501 53.0013 73.1605 76.0616 111.9539 128.1360 143.8556 190.6054 203.2911 234.4339 308.5995 317.1338 381.8518 439.0481 486.7292 553.8332 581.4235 613.4139 757.2054 775.4728 780.1839 791.8081 900.0759 940.8485 959.4471 1017.7317 1069.8537 1073.8323 1080.8127 1097.6578 1112.0446 1142.4168 1207.8336 1212.4477 1255.9383 1275.6530 1298.3561 1311.4118 1342.8026 1358.3463 1384.3474 1390.8752 1417.1609 1448.2565 1450.8695 1458.3643 1468.0056 1471.1348 1477.8939 1482.7441 1494.0871 1576.1212 2985.6258 2988.1772 2994.8802 3000.6664 3007.6584 3053.2898 3064.7698 3069.1313 3085.4228 3087.2003 3088.2844 3095.4332 3102.7687 3176.6117
redmass: 3.5262 3.4537 2.7287 3.0326 3.9510 2.3721 2.6394 5.3431 1.1600 1.2038 2.6430 2.7133 2.6544 3.3700 3.2491 4.2223 3.1768 3.7310 2.4475 1.2771 1.1681 1.4019 2.4837 2.1355 1.4770 2.8560 2.1720 3.1395 1.8919 1.7616 1.2170 1.8843 1.2544 2.7390 1.3855 1.1829 1.3312 1.4422 1.2532 1.2938 1.2167 1.2072 2.4969 1.1182 1.1017 1.1265 1.0463 1.0434 1.0621 1.0580 1.1067 5.9291 1.0358 1.0355 1.0605 1.0652 1.0629 1.1001 1.0970 1.0997 1.0989 1.0988 1.0576 1.1012 1.1021 1.1114
irintensity: 0.0317 0.2269 1.0242 3.5819 3.5345 2.3662 4.0390 0.2241 0.4870 2.8156 3.3176 5.4884 6.0922 9.8797 10.0720 35.5975 21.0410 18.2373 17.2507 13.6047 3.7520 4.2707 7.1033 8.6864 0.3227 3.5799 10.8832 3.2534 10.0634 15.7006 2.7463 41.6370 25.1202 21.1853 41.2634 3.9821 0.6358 77.8110 5.5607 8.8554 16.1867 24.8206 95.2237 29.6275 18.2454 11.2528 6.3762 14.7312 7.8639 10.0408 10.6895 283.0413 25.9398 21.4098 13.0280 36.1702 34.7262 9.6872 1.5250 8.9465 35.1493 40.1579 8.4830 42.8658 32.7442 3.8877
temp: 298.150 k
press: 1.00000 atm
elementType: 35 8 7 6 6 6 6 6 6 6 1 1 1 1 1 1 1 1 1 1 1 1 1 1
symmnumber: 1
zpe: 532451.5 jmol-1
zpe.correction: 0.202800 hartree
zpe.thermalcorrener: 0.215569 hartree
zpe.thermalcorrenthalpy: 0.216513 hartree
zpe.thermalcorrgfe: 0.161479 hartree
zpe.sumelectzpe: -417.770489 hartree
zpe.sumelectthermal: -417.757720 hartree
zpe.sumelectthermalent: -417.756776 hartree
zpe.sumelectthermalfe: -417.811810 hartree
dipole: -3.9376 2.9862 1.0098
dipole: 5.0440
quadrupole: -71.0353 -74.1547 -71.6291
quadrupole: -4.9452 -1.8152 -1.6287
quadrupole: 1.2377 -1.8816 0.6439 -4.9452 -1.8152 -1.6287
hfenergy: -417.9732889 hartree
pointgroup: C01 [X(C7H14Br1N1O1)]
dipole: -1.5975266 -1.1416482 -0.2874399 debye
dipolederiv: -0.5844663 0.0508741 0.0413595 0.1796416 -0.1970527 -0.0278644 0.0989415 -0.0222877 -0.1725078 -0.8148163 -0.0125294 0.0224728 -0.4454981 -0.9955836 -0.1907398 -0.1408488 -0.2456133 -0.4108753 -1.1686725 -0.3083423 -0.1070371 -0.1846537 -0.781461 0.0037889 -0.0344731 -0.0339413 -0.372118 0.1385677 0.0489312 0.0175434 0.1248076 0.6145823 -0.0125139 0.0853131 0.0395556 0.2589197 0.4819628 -0.1564984 0.0116691 -0.2661173 0.2418057 -0.0652404 -0.1027718 -0.0975878 0.2062416 1.4506691 0.4279407 0.0314468 0.6048175 1.055464 0.3018831 0.0961689 0.3003132 0.2421588 -0.2859407 0.0555217 0.0474508 0.3502953 -0.0812151 -0.1108952 0.2076859 -0.1069364 0.0763465 0.0694986 -0.0098307 0.0012104 -0.0344342 -0.0846234 0.0609307 -0.0113144 0.0968792 -0.0404824 -0.0393487 0.0349147 -0.0265126 0.0550197 0.0134644 0.0693958 -0.0179754 0.1060698 -0.0322276 0.8598407 -0.2017104 -0.1315709 -0.3676768 0.1988639 0.0650507 -0.2025101 0.0551933 0.1493295 -0.0859782 -0.0450462 -0.139889 -0.0257968 0.0096619 0.0304926 -0.1114431 -0.0003108 -0.0102127 -0.0238942 0.053437 0.1358725 0.026866 -0.0020498 0.0049255 0.10747 -0.0051533 -0.0064314 -0.0799421 -0.0632629 0.0482845 -0.0861587 -0.0523016 0.1181827 0.0402518 0.083696 0.0392665 0.0922649 -0.0155542 -0.0726905 0.0669721 0.0139386 -0.076453 -0.0149735 -0.0413961 -0.0184198 0.0497484 0.0133375 -0.026537 -0.0135623 0.0724658 -0.0402044 -0.0359707 -0.0506613 -0.0742973 0.0601056 0.0045192 0.021623 -0.0283474 -0.0752964 0.0597643 -0.0006811 0.0760575 0.0452428 -0.079094 0.0174218 -0.1220652 -0.0150626 0.0874029 -0.005292 -0.0993341 0.0157485 0.0126497 -0.0650789 0.0212908 0.1211762 0.0659402 0.0923895 -0.0374963 0.0993352 -0.0039244 0.0006348 0.093292 -0.0315432 -0.00863 -0.0570182 -0.170761 -0.064858 -0.0078223 -0.0861541 0.0481139 0.0319703 -0.1173418 0.0539773 -0.0731712 -0.0084998 0.0665222 0.0251816 0.0419739 0.0559248 0.09362 -0.0138649 -0.0306719 -0.0475092 -0.0270206 -0.1388561 -0.0527031 -0.0884132 -0.0694837 -0.1443151 0.11763 0.0403076 0.1316549 0.0453605 -0.0134202 0.0484129 -0.029722 0.0634611 -0.0306507 0.0531139 0.0546562 0.0289083 0.062724 -0.0410462 -0.0054005 -0.0354862 -0.0515658 -0.0193424 0.0765916 0.0165541 0.0100834 -0.0322586 0.0439433 0.0294611 0.0321008 0.0603321 unknown
polarizability: 134.0191255|-5.3683927|97.4999538|-4.2027103|5.0561076|71.6681988 unknown
InChI: InChI=1S/C7H14BrNO/c1-3-9(4-2)7(10)5-6-8/h3-6H2,1-2H3
charge 0 multiplicity 1
24 atoms
Br 4.372541 -0.296777 -0.384497
O  0.194837 1.746266 0.579212
N  -1.042851 -0.133836 -0.009768
C  -1.157102 -1.521186 -0.513075
C  -2.301226 0.564474 0.358423
C  0.154522 0.549209 0.139711
C  1.450755 -0.18758 -0.249472
C  -1.245375 -2.57393 0.615527
C  -2.927661 1.319184 -0.832927
C  2.659639 0.668331 0.139721
H  -2.063185 -1.576786 -1.146442
H  -0.302276 -1.746992 -1.172444
H  -3.005953 -0.18907 0.757483
H  -2.061504 1.278572 1.16411
H  1.467522 -0.377116 -1.340245
H  1.508732 -1.174154 0.246195
H  -0.330387 -2.572094 1.234062
H  -2.104153 -2.373265 1.280369
H  -1.372279 -3.585849 0.189346
H  -2.243021 2.109669 -1.183894
H  -3.142776 0.639296 -1.677844
H  -3.877649 1.794988 -0.527947
H  2.735429 0.831956 1.222825
H  2.687825 1.62879 -0.390125
