program: Gaussian 09
title: 000226110
version: EM64L-G09RevD.01
frameworkgroup: C1[X(C6H15NO)]
method: RPBEPBE
basis: SDD
operation: Freq
keyword: #p
keyword: freq=noraman
keyword: PBEPBE/SDD
title: #p freq=noraman PBEPBE/SDD
converged: YES YES NO NO
title: Mulliken charges:
elementType: O N C C C C C C H H H H H H H H H H H H H H H
charge: -0.440383 -0.098430 -0.069792 -0.376180 -0.372668 -0.687721 -0.616994 -0.608748 0.209631 0.185544 0.214670 0.177959 0.238247 0.212281 0.228163 0.207488 0.192175 0.222321 0.226451 0.224723 0.221158 0.190286 0.319819
chargesum: 0.00000
title: Mulliken charges with hydrogens summed into heavy atoms:
elementType: O N C C C C C C
charge: -0.120565 -0.098430 0.139839 0.024034 0.043538 -0.039789 0.023954 0.027419
polarizability: 8.63890073e+01 -1.12629479e+00 7.20109040e+01 6.26638397e-02 -2.02075024e+00 7.06820480e+01
1716.lowfreq: -20.6093 -8.7898 -0.0007 -0.0006 -0.0004 7.2197 29.3554 79.5496 94.5022
frequency: 28.7597 79.3259 94.4662 173.2683 199.5605 209.0852 236.7121 249.5804 289.1330 315.8483 348.0760 374.6448 430.4130 479.6908 523.6107 758.4456 816.1626 822.7400 924.3769 961.1872 1020.2818 1031.2336 1046.8903 1050.1346 1086.6329 1097.4428 1116.8122 1146.3663 1160.6894 1219.2151 1258.2916 1268.3500 1286.7473 1302.0678 1351.7839 1366.5158 1374.8147 1388.5008 1419.3090 1442.0603 1459.6967 1463.0178 1464.8399 1473.5328 1473.6450 1476.1620 1485.9699 1487.7114 2851.3707 2859.3781 2875.9598 2950.3059 2978.2891 2991.8922 3018.6751 3028.2863 3029.7197 3045.3852 3071.7642 3077.1985 3082.5926 3086.1937 3533.7345
redmass: 2.6991 2.1601 2.5885 2.0175 1.2510 1.3805 1.3889 1.5177 1.1361 2.7000 2.8392 1.9672 2.3056 2.5072 2.9712 1.5979 2.0005 2.8862 2.3239 1.3972 2.6365 1.5721 2.3751 1.5677 1.2742 1.6668 2.0230 1.7134 1.7075 1.4315 2.4388 1.7153 1.3422 1.2483 1.5700 1.4040 1.1904 1.2109 1.1409 1.1597 1.0522 1.0728 1.0690 1.0446 1.0684 1.0547 1.0528 1.0583 1.0568 1.0603 1.0641 1.0665 1.0360 1.0894 1.0726 1.0770 1.0855 1.0902 1.0993 1.1009 1.0998 1.1003 1.0657
irintensity: 1.1154 0.1757 2.7719 0.6136 1.0857 0.0910 0.7754 1.7604 100.1051 4.6669 53.0009 1.7663 3.6599 4.9390 14.1740 0.5823 10.8553 18.3257 56.3236 16.6551 21.6195 20.3607 3.6604 57.3402 5.4930 25.8617 4.1804 1.6552 10.7401 9.7739 12.5610 4.8655 9.5570 2.6823 8.0534 7.9114 12.5923 14.8376 3.1089 2.8272 6.5150 3.1512 14.3667 10.1602 15.0764 19.2527 12.0041 15.2355 71.6289 92.0172 193.1623 27.9174 35.4599 24.6000 40.0896 35.5636 9.6024 37.8637 57.7513 40.8212 37.2957 41.5925 3.9735
temp: 298.150 k
press: 1.00000 atm
elementType: 8 7 6 6 6 6 6 6 1 1 1 1 1 1 1 1 1 1 1 1 1 1 1
symmnumber: 1
zpe: 538406.6 jmol-1
zpe.correction: 0.205068 hartree
zpe.thermalcorrener: 0.215994 hartree
zpe.thermalcorrenthalpy: 0.216938 hartree
zpe.thermalcorrgfe: 0.168542 hartree
zpe.sumelectzpe: -366.885941 hartree
zpe.sumelectthermal: -366.875016 hartree
zpe.sumelectthermalent: -366.874072 hartree
zpe.sumelectthermalfe: -366.922467 hartree
dipole: 1.4839 -0.3210 -1.2862
dipole: 1.9898
quadrupole: -51.5672 -53.8386 -50.4630
quadrupole: 1.2706 3.6474 -5.0958
quadrupole: 0.3891 -1.8823 1.4932 1.2706 3.6474 -5.0958
hfenergy: -367.0910097 hartree
pointgroup: C01 [X(C6H15N1O1)]
dipole: -0.6094337 -0.0993104 0.4812355 debye
dipolederiv: -0.7745207 -0.0742545 -0.0412373 -0.088756 -0.7259609 0.1541212 -0.0447833 0.1385327 -0.1391591 -0.6948082 0.0172699 -0.0174423 -0.0009498 -0.5170531 0.0357446 -0.0231875 0.0236535 -0.522812 0.4849615 0.1099808 0.046496 0.118847 0.530907 -0.0415356 0.0696037 -0.0342763 0.2475327 0.2629415 0.1267112 0.0790561 0.1767667 0.3367275 -0.1025023 0.0847144 -0.0723214 0.2004708 -0.0602341 0.0381696 -0.0290322 -0.0126866 -0.0083226 0.0862826 0.0080551 0.1548199 0.055556 -0.0352509 0.0332487 0.024473 0.0708508 0.0410253 0.0008944 -0.0012345 0.0153327 0.0667823 0.1510559 -0.070155 0.153676 -0.0763306 0.2658779 -0.0090573 0.1980258 -0.0104231 0.4227845 0.4486911 -0.1489095 -0.1034577 -0.1786227 0.2506392 -0.0651694 -0.1542244 -0.0638498 0.2291024 0.0570244 -0.0103902 0.015332 -0.0029686 -0.0166955 -0.068248 -0.0153485 -0.0717546 -0.1205531 0.046002 -0.0329942 -0.0167606 -0.0345629 0.0132483 -0.0714246 -0.0066324 -0.1171691 -0.1447244 -0.0699934 0.0845956 -0.0747503 -0.0056554 -0.1594696 0.0962364 -0.0246104 0.1825487 -0.0430472 0.0391787 0.0431112 -0.0017258 0.0200064 -0.0303788 -0.1498809 -0.0053779 -0.1015229 -0.1308197 0.0334017 -0.0940799 0.0468981 -0.1085502 -0.0457255 0.0285349 0.0493085 0.0084723 0.0815746 -0.0028158 0.0867109 -0.065512 0.1092724 -0.011969 0.1065376 -0.100613 0.1242491 -0.0470181 -0.0273879 -0.0832705 0.0294321 -0.1609376 -0.0192846 0.0265777 0.0530083 0.0098055 0.085759 0.0630576 -0.0216015 -0.0402025 0.0075412 0.0102581 -0.1136602 0.0120556 -0.1415584 -0.0988485 -0.0124732 0.0598925 -0.1414249 0.1426015 -0.0965466 0.1880189 -0.1071691 0.0226444 -0.1390292 -0.0249941 -0.1513156 -0.0495339 -0.1362439 -0.0720009 -0.0095267 0.0116382 0.0317236 0.0727417 -0.0781222 0.0939792 0.1302586 0.0788203 0.085311 -0.0134927 0.0925817 -0.0364517 -0.0033355 0.0661079 -0.0079662 -0.0802555 0.0291063 0.076476 -0.0891642 -0.0180547 -0.0589758 -0.1547527 -0.0622859 -0.097669 0.0374896 -0.1551509 -0.09161 0.0211936 -0.0090287 -0.0114361 0.1081596 -0.1539735 0.1150791 0.0407095 0.2471946 -0.1257749 0.0395287 -0.0804676 0.1252005 -0.0046816 0.3444377 -0.0161426 0.0575141 -0.039592 0.3103217 -0.0500087 0.0117408 -0.1172434 -0.0216824 unknown
polarizability: 86.308454|1.2406881|72.327275|0.8197112|1.9769689|70.4462303 unknown
InChI: InChI=1S/C6H15NO/c1-4-6(8)5-7(2)3/h6,8H,4-5H2,1-3H3
charge 0 multiplicity 1
23 atoms
O  1.699469 1.632836 -0.435652
N  -1.539793 -0.309314 0.01827
C  0.870579 0.411203 -0.300989
C  -0.583849 0.823925 0.037104
C  1.464895 -0.574994 0.721624
C  2.840096 -1.130205 0.29834
C  -1.844428 -0.782305 -1.348808
C  -2.771997 -0.020392 0.781261
H  0.920271 -0.026366 -1.314339
H  -0.591767 1.254312 1.060047
H  -0.880899 1.642551 -0.666141
H  1.54771 -0.058104 1.703096
H  0.733672 -1.393898 0.861857
H  3.279219 -1.764148 1.090255
H  3.544971 -0.307803 0.080121
H  2.751759 -1.7465 -0.616224
H  -2.340682 -0.00185 -1.98057
H  -2.515456 -1.658048 -1.293902
H  -0.921274 -1.098959 -1.863279
H  -2.51404 0.240498 1.823138
H  -3.412769 -0.920449 0.803452
H  -3.376001 0.819462 0.35216
H  1.786316 2.044948 0.462982
