program: Gaussian 09
title: 000226083
version: EM64L-G09RevD.01
frameworkgroup: C1[X(C4H8ClNO3)]
method: RPBEPBE
basis: SDD
operation: Freq
keyword: #p
keyword: freq=noraman
keyword: PBEPBE/SDD
title: #p freq=noraman PBEPBE/SDD
converged: YES YES NO NO
title: Mulliken charges:
elementType: Cl O O O N C C C C H H H H H H H H
charge: -0.062300 -0.419820 -0.187428 -0.225008 0.123693 -0.061227 -0.092097 -0.661323 -0.619074 0.268924 0.269135 0.238818 0.256396 0.233655 0.292462 0.298928 0.346265
chargesum: 0.00000
title: Mulliken charges with hydrogens summed into heavy atoms:
elementType: Cl O O O N C C C C
charge: -0.062300 -0.073555 -0.187428 -0.225008 0.123693 0.207698 0.177038 0.067546 -0.027684
polarizability: 6.95390583e+01 -4.83991554e-01 6.93044910e+01 5.36845249e+00 4.62280413e+00 7.05871278e+01
1716.lowfreq: -7.6245 -0.0005 0.0020 0.0022 3.6120 7.7674 13.9720 47.8302 96.0639
frequency: 9.6013 47.6935 96.0591 174.8844 192.5300 211.6316 257.8365 270.2696 346.8180 376.1809 439.3348 481.7443 551.1022 641.8695 654.5767 688.7801 803.3870 853.0562 874.1840 977.3927 1019.4393 1063.7203 1079.0789 1114.2558 1187.2789 1215.6892 1224.1508 1260.2142 1284.6914 1294.2121 1335.8631 1371.0123 1385.3620 1423.4631 1446.7145 1467.9074 1477.1259 3002.1202 3046.6791 3066.4449 3076.4545 3107.6197 3116.9461 3161.6673 3485.8883
redmass: 12.7570 7.1321 5.4352 4.3566 7.1318 1.0387 3.0532 4.9357 7.0068 2.8337 1.0932 4.4652 4.8264 4.8050 7.1433 4.6116 5.0325 2.1141 2.4015 1.6334 2.3800 1.7977 1.6737 1.8558 1.7855 2.4216 1.7297 1.5279 1.6026 1.2579 1.2652 1.3070 1.2454 3.4953 1.1190 1.0583 1.0523 1.0350 1.0831 1.0860 1.0590 1.1006 1.1004 1.1114 1.0654
irintensity: 0.1161 3.5035 1.0232 7.5100 9.5585 0.3629 3.9395 2.1842 5.6656 4.5151 135.4749 5.2826 32.4175 7.5422 7.1292 3.7470 20.6058 5.9128 20.5252 48.7653 41.6721 4.6995 11.2350 39.1358 42.9931 51.5121 5.0210 12.0804 35.7071 16.4588 10.8833 19.6769 38.0891 124.5437 16.4072 9.7320 12.5902 11.8442 0.9064 1.3325 8.2091 13.6627 4.1931 2.7160 21.9455
temp: 298.150 k
press: 1.00000 atm
elementType: 17 8 8 8 7 6 6 6 6 1 1 1 1 1 1 1 1
symmnumber: 1
zpe: 332938.3 jmol-1
zpe.correction: 0.126809 hartree
zpe.thermalcorrener: 0.137073 hartree
zpe.thermalcorrenthalpy: 0.138017 hartree
zpe.thermalcorrgfe: 0.088641 hartree
zpe.sumelectzpe: -896.889759 hartree
zpe.sumelectthermal: -896.879496 hartree
zpe.sumelectthermalent: -896.878551 hartree
zpe.sumelectthermalfe: -896.927928 hartree
dipole: -1.2632 2.1281 -0.0488
dipole: 2.4753
quadrupole: -64.8487 -67.9318 -58.9321
quadrupole: 5.9692 -3.0632 -3.4857
quadrupole: -0.9445 -4.0276 4.9721 5.9692 -3.0632 -3.4857
hfenergy: -897.0165686 hartree
pointgroup: C01 [X(C4H8Cl1N1O3)]
dipole: 0.6297468 0.7422194 -0.0299034 debye
dipolederiv: -0.3154127 0.1242301 -0.0938463 0.1207487 -0.3155962 0.0398177 -0.1606596 0.114121 -0.3123779 -0.7294492 -0.1991742 0.1239118 -0.1871004 -0.5329218 -0.1599831 0.1576888 -0.1708165 -0.3786463 -0.3379579 -0.2059346 0.0912695 -0.2546698 -0.4806089 0.2599893 0.0100899 0.1174788 -0.597372 -0.3791433 -0.100741 -0.1648355 -0.1560706 -0.376978 -0.0186397 -0.0066973 0.0944043 -0.7254168 0.4196562 0.4242694 0.1395718 0.5669468 0.6282389 -0.253812 0.0934611 -0.2004374 1.0768369 0.0946678 -0.0941801 0.0095573 -0.1154752 0.010908 -0.0218754 0.0517544 0.0285352 0.0338108 0.5739013 0.199431 -0.0896835 0.2013011 0.3057938 0.0385701 -0.2198555 0.0855821 0.1722278 -0.0941913 -0.0433584 -0.0092208 -0.0226748 -0.0104324 -0.0070079 -0.0056627 -0.051932 0.0592927 0.2496875 -0.1228653 0.2216654 -0.2103849 0.172626 -0.191223 0.2882052 -0.2128186 0.3799579 0.0262589 -0.0250959 -0.0490852 0.001127 0.0239248 0.0553031 -0.034867 0.0342857 0.0192286 0.032112 0.0129763 -0.0705113 0.0571444 0.0276631 0.0602043 -0.0103922 -0.0154899 0.0161675 -0.0015409 0.0399079 0.1060394 0.0014471 0.0707053 0.0351017 0.1193621 -0.0043548 -0.0172569 0.0745873 -0.0721517 -0.0374964 -0.080261 0.0099261 -0.0358753 -0.0416458 -0.019128 0.1129049 0.0594681 0.0468133 -0.0487677 0.0289905 0.0807881 -0.0101496 -0.0940692 0.0567086 -0.051931 0.0478429 -0.0605066 -0.0929775 -0.0418133 -0.0054977 0.0245745 -0.0732951 0.015401 0.0423764 -0.0346869 0.0438105 0.0356739 0.0297432 0.0801982 0.0588361 0.0265836 0.0380505 -0.0431086 0.3142001 0.0325694 -0.0712647 0.0610013 0.3112625 0.1261691 -0.1000007 0.0904102 0.2133059 unknown
polarizability: 69.9382983|0.4652676|68.6846713|4.5255975|-5.3902372|70.8077075 unknown
InChI: InChI=1S/C4H8ClNO3/c1-3(6(8)9)4(7)2-5/h3-4,7H,2H2,1H3
charge 0 multiplicity 1
17 atoms
Cl 2.474959 -1.315225 0.507006
O  1.724802 1.649212 -0.223268
O  -1.773743 -1.388325 0.956489
O  -1.734293 -0.593406 -1.183544
N  -1.350269 -0.584343 0.049874
C  -0.329871 0.488134 0.461228
C  0.772057 0.617512 -0.632805
C  -1.081815 1.814061 0.67447
C  1.484666 -0.689883 -0.991676
H  0.102878 0.114528 1.405135
H  0.303091 1.001422 -1.556693
H  -1.791092 1.736157 1.515335
H  -0.340557 2.599052 0.896611
H  -1.633863 2.100059 -0.237863
H  0.797827 -1.502467 -1.265354
H  2.236561 -0.523139 -1.775694
H  2.374263 1.234152 0.407349
