program: Gaussian 09
title: 000226078
version: EM64L-G09RevD.01
frameworkgroup: C1[X(C8H13NO2)]
method: RPBEPBE
basis: SDD
operation: Freq
keyword: #p
keyword: freq=noraman
keyword: PBEPBE/SDD
title: #p freq=noraman PBEPBE/SDD
converged: NO YES NO NO
title: Mulliken charges:
elementType: O O N C C C C C C C C H H H H H H H H H H H H H
charge: -0.208617 -0.211600 0.088304 -0.141649 -0.081683 -0.093174 -0.485194 -0.471961 -0.473265 -0.454146 -0.443322 0.252976 0.213323 0.274124 0.247719 0.220777 0.215577 0.243026 0.223780 0.221785 0.231289 0.208460 0.212187 0.211284
chargesum: 0.00000
title: Mulliken charges with hydrogens summed into heavy atoms:
elementType: O O N C C C C C C C C
charge: -0.208617 -0.211600 0.088304 0.111327 0.131640 0.180950 -0.016698 -0.013358 -0.027700 -0.014397 -0.019851
polarizability: 1.01521302e+02 2.28879140e+00 9.45165448e+01 1.91012071e+00 -4.50866771e-01 8.08290681e+01
1716.lowfreq: -13.6689 -0.0008 -0.0007 0.0004 7.8670 22.7280 46.6807 64.0039 167.2178
frequency: 45.2667 62.9094 167.1602 192.8542 263.9973 305.7381 350.7807 373.4032 404.9010 504.3277 551.9875 592.8635 630.3104 691.7137 769.9746 791.6143 801.0691 815.0141 823.5732 869.0100 894.3531 909.9448 959.5407 960.4846 974.0825 1052.1035 1067.2722 1080.6489 1088.6125 1103.6804 1134.0137 1157.1893 1182.4328 1207.8721 1224.2266 1229.5400 1242.9904 1272.7862 1282.3886 1294.1578 1306.5073 1318.5209 1323.8453 1325.9533 1333.3379 1354.7896 1361.5557 1421.2860 1460.9951 1464.4741 1475.3951 1479.5660 1496.4913 2981.1283 2988.5691 2996.1212 3000.7055 3004.3567 3023.9457 3031.2524 3034.3174 3040.5191 3053.4497 3057.5122 3066.7188 3071.2434
redmass: 4.4564 4.4174 2.7112 3.4239 2.1237 3.7221 2.3318 2.3698 3.5943 4.2628 4.0509 5.5229 6.5283 4.6615 3.1249 1.9189 2.2093 1.8640 2.3095 2.5804 2.4550 1.6495 2.0609 4.2385 2.4725 2.2290 2.2300 1.7629 1.8891 1.5933 1.0895 1.0285 1.2987 2.2595 1.2143 1.1351 1.9340 1.7037 1.4987 1.6444 1.5555 1.4643 1.3756 1.5820 1.5316 1.4900 1.4404 3.4255 1.1279 1.0758 1.0801 1.0878 1.1019 1.0597 1.0604 1.0641 1.0625 1.0627 1.0830 1.1005 1.0875 1.1026 1.0897 1.1035 1.1029 1.0988
irintensity: 1.0687 0.5243 2.5448 2.4842 0.3000 1.0375 0.5029 0.4861 2.1377 0.2589 3.8401 2.0136 3.4383 1.5711 14.5602 1.6736 9.9421 3.8423 4.8936 3.2958 9.7824 3.2938 0.9333 0.7662 2.4691 0.9615 0.9223 3.3280 0.6066 1.4717 2.6298 0.3774 16.9221 45.5461 2.1013 0.6444 26.0320 4.5338 42.1897 6.5455 1.8601 2.2364 1.2059 5.2381 4.0360 12.5414 3.8415 105.0175 15.5056 0.7964 12.1263 14.6241 4.1574 25.7788 12.8016 50.8727 12.3457 71.8561 103.6432 1.7350 8.6004 1.6191 2.3120 33.2867 71.3136 21.5954
temp: 298.150 k
press: 1.00000 atm
elementType: 8 8 7 6 6 6 6 6 6 6 6 1 1 1 1 1 1 1 1 1 1 1 1 1
symmnumber: 1
zpe: 537119.4 jmol-1
zpe.correction: 0.204578 hartree
zpe.thermalcorrener: 0.214046 hartree
zpe.thermalcorrenthalpy: 0.214990 hartree
zpe.thermalcorrgfe: 0.169298 hartree
zpe.sumelectzpe: -516.907923 hartree
zpe.sumelectthermal: -516.898455 hartree
zpe.sumelectthermalent: -516.897511 hartree
zpe.sumelectthermalfe: -516.943203 hartree
dipole: -4.3446 0.7249 -0.8215
dipole: 4.4806
quadrupole: -77.6294 -67.5052 -62.6000
quadrupole: 0.0901 -1.7295 0.3094
quadrupole: -8.3846 1.7397 6.6449 0.0901 -1.7295 0.3094
hfenergy: -517.112501 hartree
pointgroup: C01 [X(C8H13N1O2)]
dipole: -1.6965081 -0.3220262 0.3544174 debye
dipolederiv: -0.7103957 0.2592659 0.0736931 0.1339489 -0.6097622 0.0179546 0.1730729 -0.0554583 -0.2300331 -0.5022082 -0.1352469 0.0637292 0.0665348 -0.7644806 -0.0222843 0.1453113 0.1006949 -0.2197475 1.0216264 -0.0933328 -0.1577462 -0.0904617 1.0964542 -0.0340125 -0.3972363 -0.0901565 0.083554 0.1247666 0.016519 0.0613576 0.0201599 0.0969259 0.0151103 0.2573283 0.0548436 0.1029012 0.1352802 -0.0044814 0.0042619 -0.0095344 0.1354994 0.0126602 0.0132144 0.0106226 0.0870667 -0.0380016 -0.0981647 -0.0297876 -0.1478491 0.0875104 -0.0118253 -0.0765989 -0.0052364 0.1643408 -0.0430177 -0.0185298 -0.0246671 -0.0630809 -0.0319605 -0.0139504 -0.0072712 -0.0277777 0.0924617 0.0673068 0.0122746 -0.0070118 0.0243991 -0.0108972 0.0360043 -0.0307973 0.0511225 0.0479824 0.0166452 -0.0081382 0.0495435 -0.0458092 0.1008882 -0.00023 -0.0680992 -0.0419335 0.0814158 0.1115187 -0.0080095 0.0353539 -0.0238463 0.0781541 0.0235937 0.0309209 0.0076679 -0.0104664 0.0977541 -0.0410033 -0.0012792 -0.0184686 -0.0150151 -0.0232554 -0.0061292 -0.0095183 0.1146586 -0.0286519 0.0894466 0.0560561 0.0642584 -0.0484379 -0.0654198 0.0279043 -0.0561526 -0.0003002 -0.0302901 0.0811859 0.0698059 0.0949448 -0.0813705 -0.0956862 0.069347 -0.0968263 -0.0295207 -0.0052969 0.046816 -0.0083955 0.065809 -0.0236251 0.0706973 0.0268201 0.0564797 0.004209 0.0510218 -0.0797569 -0.0320182 -0.0518643 -0.0200364 -0.0434749 -0.0132072 0.0247084 0.1033929 0.0426593 0.0358312 0.0370719 0.0396117 0.0596738 0.0897495 0.0153223 0.0364581 -0.1588356 -0.0085106 -0.025778 -0.1284841 -0.0066562 0.0314985 -0.0928061 -0.0812789 -0.0641257 -0.08631 -0.075906 -0.0432322 0.1260668 -0.0516567 0.0072913 0.0407709 0.0799395 0.0096225 0.0388097 0.0507774 0.0742346 -0.0076123 0.0319074 -0.1099347 0.0859957 -0.0010927 0.1370247 -0.0249362 -0.0430308 -0.0586493 -0.0810238 -0.0415805 0.0259328 -0.0574014 -0.0748509 -0.1124433 -0.0719316 0.0203535 -0.1270588 0.0240449 -0.0618539 -0.1174375 0.0073277 0.0263049 -0.0180495 0.0558274 -0.1434093 0.1039315 -0.1000622 0.0374954 0.0538408 0.0046051 -0.0917943 0.0225002 -0.0044544 -0.165249 0.0262384 -0.0579849 0.0461865 0.0461148 -0.0121587 -0.1230934 -0.0013762 0.0261634 0.0542579 -0.0043618 0.0350883 -0.0125944 0.0131735 0.0680354 0.1059638 0.0673093 -0.166248 unknown
polarizability: 101.4235866|-2.0797713|94.4763815|-2.6646712|0.4701897|80.9669465 unknown
InChI: InChI=1S/C8H13NO2/c10-9(11)8-5-6-1-3-7(8)4-2-6/h6-8H,1-5H2
charge 0 multiplicity 1
24 atoms
O  2.853384 -0.932247 -0.156996
O  2.225859 1.254026 -0.081314
N  2.001114 0.000191 0.095309
C  -0.204034 -0.939641 -0.667184
C  -1.541513 0.870161 0.668049
C  0.609973 -0.468857 0.577131
C  -0.164237 0.634378 1.342426
C  -0.530945 0.261031 -1.591676
C  -1.5266 -1.549513 -0.124147
C  -1.317633 1.354015 -0.789395
C  -2.34203 -0.45951 0.653208
H  0.377266 -1.707584 -1.210078
H  -2.096579 1.639068 1.238167
H  0.846507 -1.345355 1.203759
H  0.424287 1.569093 1.328464
H  -0.29462 0.334105 2.398199
H  -1.133253 -0.112401 -2.440534
H  0.39466 0.681916 -2.023752
H  -1.304313 -2.41794 0.52495
H  -2.107804 -1.936551 -0.981467
H  -0.753693 2.304669 -0.780937
H  -2.295181 1.560882 -1.26408
H  -3.325289 -0.292699 0.174912
H  -2.543726 -0.787738 1.690585
