program: Gaussian 09
title: 000226093
version: EM64L-G09RevD.01
frameworkgroup: C1[X(C8H7N3O6S)]
method: RPBEPBE
basis: SDD
operation: Freq
keyword: #p
keyword: freq=noraman
keyword: PBEPBE/SDD
title: #p freq=noraman PBEPBE/SDD
converged: YES YES NO NO
title: Mulliken charges:
elementType: S O O O O O O N N N C C C C C C C C H H H H H H H
charge: 0.450437 -0.166536 -0.195711 -0.134843 -0.149017 -0.189765 -0.180978 0.149922 0.172646 0.012044 -0.156978 -0.633717 -0.335630 0.434491 -0.153347 -0.336059 -0.263428 -0.202945 0.270358 0.254149 0.274108 0.283939 0.292733 0.252284 0.251842
chargesum: 0.00000
title: Mulliken charges with hydrogens summed into heavy atoms:
elementType: S O O O O O O N N N C C C C C C C C
charge: 0.450437 -0.166536 -0.195711 -0.134843 -0.149017 -0.189765 -0.180978 0.149922 0.172646 0.012044 -0.156978 0.164898 -0.335630 0.434491 0.130593 -0.043326 -0.011144 0.048897
polarizability: 2.31627092e+02 4.63896303e+00 1.76544782e+02 -7.91539263e+00 1.02803404e+01 8.57965725e+01
1716.lowfreq: -8.4754 -1.7058 -0.0015 0.0016 0.0019 1.7108 20.8371 42.2929 52.2709
frequency: 20.7892 42.2902 52.2333 78.5442 94.9996 109.0382 143.8231 149.9113 176.2632 191.4454 198.7417 219.3516 231.8616 283.1583 298.2154 309.3723 348.4024 382.8886 398.9303 429.1964 441.5175 458.2524 489.3506 534.9282 556.0583 634.3509 641.9831 661.6307 673.0757 679.1907 718.8487 727.7009 754.6251 766.3026 787.6067 789.5715 891.1496 980.6470 1004.4415 1016.7381 1043.0034 1069.1362 1085.3853 1101.7066 1126.7620 1144.1839 1163.9622 1183.7837 1203.9968 1209.6850 1276.5558 1355.2578 1380.1595 1393.4461 1411.9806 1425.2089 1430.6880 1453.0108 1458.1444 1458.8188 1571.9034 1592.2778 3017.7320 3115.5287 3140.6807 3149.7239 3166.3386 3176.0401 3186.5997
redmass: 10.3066 8.9657 13.4874 10.0631 8.7738 11.1530 6.3560 9.3178 7.8256 3.8912 1.2965 6.1333 8.8333 6.0754 3.7988 4.2752 9.9325 12.1406 11.7659 4.2793 9.9794 8.3702 4.3878 6.5805 7.0973 6.0769 6.9709 5.8730 6.4926 7.8654 3.8249 6.2468 8.0379 8.8028 1.5700 5.7482 1.3139 1.3560 1.3448 7.0120 2.9295 1.7956 1.6329 2.3622 5.0496 2.0214 12.6589 1.1414 7.6878 11.0148 1.4705 9.9979 5.6099 1.4428 4.2388 2.6279 4.7890 1.3972 1.2758 1.3290 6.3536 6.1114 1.0365 1.1009 1.0984 1.0875 1.0905 1.0946 1.0998
irintensity: 1.0436 1.6016 0.2144 0.0663 0.3224 1.1420 0.8344 0.5942 7.6920 3.5864 2.2622 3.8186 10.6330 1.2054 1.6349 1.0959 1.8381 1.7518 3.1227 3.9060 0.7886 6.3440 6.1547 1.0109 1.2183 0.7039 3.5760 6.2443 6.6305 13.3016 16.7527 29.3102 59.0714 26.2173 56.0054 15.3431 0.4170 3.6824 0.6021 26.5031 3.1543 7.3469 18.3964 15.6999 18.5921 10.7316 105.6658 4.8213 132.4055 210.4484 4.6090 208.1749 6.5916 98.0843 86.7709 6.4512 134.0703 15.0040 53.9715 17.8036 21.8522 23.0443 0.9707 0.7350 0.9130 5.2043 1.4348 9.9913 8.9706
temp: 298.150 k
press: 1.00000 atm
elementType: 16 8 8 8 8 8 8 7 7 7 6 6 6 6 6 6 6 6 1 1 1 1 1 1 1
symmnumber: 1
zpe: 411869.0 jmol-1
zpe.correction: 0.156873 hartree
zpe.thermalcorrener: 0.173978 hartree
zpe.thermalcorrenthalpy: 0.174922 hartree
zpe.thermalcorrgfe: 0.110538 hartree
zpe.sumelectzpe: -1321.101381 hartree
zpe.sumelectthermal: -1321.084276 hartree
zpe.sumelectthermalent: -1321.083332 hartree
zpe.sumelectthermalfe: -1321.147716 hartree
dipole: -3.5403 5.4552 3.0597
dipole: 7.1871
quadrupole: -120.1523 -117.4872 -110.3905
quadrupole: -13.4635 4.9601 1.6835
quadrupole: -4.1423 -1.4772 5.6195 -13.4635 4.9601 1.6835
hfenergy: -1321.2582536 hartree
pointgroup: C01 [X(C8H7N3O6S1)]
dipole: -1.4981266 1.8771039 1.492468 debye
dipolederiv: 0.1932934 0.1917545 0.1102774 0.3472464 0.1969176 0.1496076 0.2436061 0.1319451 0.0724362 -0.8262221 0.022867 -0.2419881 0.0977396 -0.3810257 -0.087741 -0.1902719 -0.0917487 -0.2893035 -0.2120311 0.0065451 0.1266178 -0.1170709 -0.7669117 -0.1977774 0.1652988 -0.0437845 -0.4285504 -0.5815457 0.1420797 -0.0789022 -0.0363501 -0.5650303 -0.1897111 -0.203127 -0.1505458 -0.2187042 -0.3361736 -0.0091929 0.2398349 -0.0499709 -0.3884794 0.0341411 0.4772227 0.061061 -0.5861679 -1.0082405 -0.3543524 0.036475 -0.2883892 -0.5327098 -0.0396876 0.2178287 0.0220829 -0.2317715 -0.7816529 -0.0754897 0.0690039 0.104163 -0.5012286 -0.148143 0.1702329 -0.1087351 -0.2715812 1.2069917 -0.2054147 0.3824811 -0.2381159 0.9309486 0.2853218 0.3781232 0.3257276 0.2520164 0.1517475 0.1023052 -0.4081516 0.4150001 1.1878751 0.1043825 -0.9064962 -0.1606511 0.7730953 1.3214614 0.4045336 -0.1811712 0.268434 1.2421534 0.2733064 -0.3942116 0.1741533 0.3184014 0.4131206 -0.0783873 0.0796145 -0.0235144 -0.2939586 -0.0239949 0.2144019 -0.0377067 0.3946775 -0.223893 0.0686591 -0.074828 -0.0474633 -0.069686 -0.0352418 -0.0510204 0.0037298 -0.1848548 0.592778 0.0296971 -0.0059191 -0.5916494 0.243116 0.0055786 -0.2095662 -0.0035537 -0.0858387 -0.1771451 -0.0742751 0.0260883 -0.1997481 -0.5888807 -0.1368235 -0.1053576 -0.1453683 0.0266633 -0.2550541 0.1380284 0.0201802 0.4080698 -0.2653404 -0.0302324 0.1330266 -0.0563167 -0.0987012 -0.0962412 -0.1158328 -0.0412806 0.1942396 0.1684474 0.049782 0.0573491 0.1086374 -0.064488 0.2917351 0.0387881 -0.0054122 0.0050903 0.1975633 0.0548809 -0.0226282 0.0569125 -0.0933528 -0.0879803 -0.1870333 -0.0578234 -0.2840749 -0.1493478 0.0105754 -0.0641188 0.022437 -0.1328584 0.0585935 0.0637683 0.0241766 0.097068 0.0395061 -0.0140823 0.0659098 -0.0077413 0.1306255 0.1045766 -0.0491869 0.0203177 -0.0297028 0.0018207 0.0627446 0.0359691 0.0342311 0.063069 0.0021279 -0.0413808 -0.0463738 -0.0387505 0.1098892 -0.0280866 -0.0553236 -0.0029241 0.0659634 0.108301 -0.0598422 -0.0186468 -0.0111577 0.0856453 -0.0200424 0.018127 -0.0163028 0.1277125 0.0725238 -0.0074561 -0.0000868 -0.0584053 0.1086964 -0.0087935 0.0025493 -0.0339017 0.1634706 0.0853572 -0.0305598 -0.0032823 0.0003699 -0.0499151 -0.0365123 -0.0014422 -0.0443398 0.1453559 -0.016428 0.0793776 0.0287989 0.0769427 0.0399352 -0.0334511 0.0239183 -0.0372973 0.1526855 unknown
polarizability: 231.7293994|6.1932967|170.6784232|-1.638894|25.1482289|91.5606235 unknown
InChI: InChI=1S/C8H7N3O6S/c1-8(10(14)15,11(16)17)18-7-5-3-2-4-6(7)9(12)13/h2-5H,1H3
charge 0 multiplicity 1
25 atoms
S  0.331362 -0.995625 -0.583334
O  4.078312 -0.847376 0.782524
O  2.202056 2.22885 -0.006605
O  2.749573 -2.3376 -0.32379
O  2.947029 0.776343 -1.603945
O  -3.858358 -2.268106 -0.37436
O  -1.714142 -2.449542 -1.134776
N  2.977991 -1.220052 0.243384
N  2.381629 1.051028 -0.491615
N  -2.689221 -1.775563 -0.595508
C  1.810003 -0.151121 0.335485
C  1.592804 0.192921 1.79941
C  -1.087583 0.139075 -0.209183
C  -2.419261 -0.373961 -0.239143
C  -0.93541 1.520441 0.071415
C  -3.543723 0.437535 0.042852
C  -2.054732 2.334392 0.343895
C  -3.363725 1.797296 0.340536
H  0.793825 0.936782 1.922584
H  1.304685 -0.724104 2.340648
H  2.522658 0.59543 2.233942
H  0.050105 1.991441 0.061391
H  -4.533567 -0.02589 0.009697
H  -1.896203 3.398583 0.546526
H  -4.228205 2.434123 0.54897
