program: Gaussian 09
title: 000226079
version: EM64L-G09RevD.01
frameworkgroup: C1[X(C9H11NO2)]
method: RPBEPBE
basis: SDD
operation: Freq
keyword: #p
keyword: freq=noraman
keyword: PBEPBE/SDD
title: #p freq=noraman PBEPBE/SDD
converged: YES YES NO NO
title: Mulliken charges:
elementType: O O N C C C C C C C C C H H H H H H H H H H H
charge: -0.200444 -0.209311 0.139475 -0.266723 0.512689 -0.421059 -0.356200 -0.680906 0.443005 -0.410085 -0.358732 -0.803071 0.251006 0.233631 0.254446 0.247504 0.232457 0.231621 0.234479 0.232697 0.231372 0.225454 0.236695
chargesum: 0.00000
title: Mulliken charges with hydrogens summed into heavy atoms:
elementType: O O N C C C C C C C C C
charge: -0.200444 -0.209311 0.139475 -0.015718 0.512689 -0.187428 -0.101754 0.030676 0.443005 -0.175606 -0.126035 -0.109551
polarizability: 1.46377783e+02 1.39492039e+00 1.11360845e+02 5.33999292e+00 4.71419057e+00 7.33890920e+01
1716.lowfreq: -5.2056 -0.0007 0.0006 0.0008 6.1739 10.7677 26.0520 37.6584 44.4616
frequency: 25.4552 37.5495 44.4123 79.2283 158.1956 191.7803 221.5462 245.3632 303.1250 343.7348 374.8727 402.5887 408.5220 497.7290 547.6594 618.9793 642.9729 667.8586 725.5542 750.8343 778.6475 813.8450 832.8116 849.2876 954.1298 976.0913 981.0163 993.8124 1014.4666 1048.6501 1056.1343 1096.8846 1137.2592 1196.2667 1204.6284 1216.6139 1224.5387 1268.2097 1295.4240 1329.7499 1383.3290 1389.9438 1399.2428 1412.2196 1434.0799 1464.0210 1470.1447 1475.2195 1477.4325 1508.5297 1585.9233 1622.9857 2979.1557 3002.7487 3057.9357 3070.2454 3087.7708 3099.9157 3118.3169 3120.1987 3123.2421 3143.0071 3153.3823
redmass: 1.0437 4.2522 10.4535 4.7495 4.4382 3.4411 1.0845 2.7012 4.4673 3.5879 3.5830 4.4781 3.2590 3.5818 3.3503 4.6458 5.9050 5.1359 3.0793 3.1304 6.5233 4.5658 1.5756 1.2585 1.3532 1.3976 1.6172 1.6382 2.8669 1.5654 1.4810 2.2987 1.4464 1.1842 3.1701 2.3113 3.0325 1.9456 1.5441 1.4827 4.0338 1.2370 1.2795 2.4615 3.9765 1.0536 1.0489 1.1033 1.0539 2.6134 5.9414 6.3263 1.0374 1.0357 1.0974 1.0871 1.0989 1.1005 1.0978 1.0890 1.0888 1.0964 1.0959
irintensity: 0.6142 0.7346 0.1297 2.6016 2.5059 0.6633 0.1257 0.7943 1.7935 1.8769 0.9802 2.3060 0.4066 9.1880 23.1125 2.6111 0.3765 13.1245 5.0643 8.0438 9.9308 0.2218 44.0763 1.4362 1.1038 0.6401 1.6326 7.6387 5.7083 13.3561 19.7037 10.0277 4.5531 4.8379 30.7158 35.7729 1.0355 78.6752 5.4584 0.1405 6.4776 37.3916 10.6091 3.0514 93.6468 6.0503 13.8225 22.8374 11.4405 24.5309 0.0834 9.8644 29.9962 15.3291 19.2123 2.9311 18.7690 23.8460 10.1125 14.3863 13.1119 23.3241 2.4663
temp: 298.150 k
press: 1.00000 atm
elementType: 8 8 7 6 6 6 6 6 6 6 6 6 1 1 1 1 1 1 1 1 1 1 1
symmnumber: 1
zpe: 479316.2 jmol-1
zpe.correction: 0.182562 hartree
zpe.thermalcorrener: 0.194509 hartree
zpe.thermalcorrenthalpy: 0.195453 hartree
zpe.thermalcorrgfe: 0.142491 hartree
zpe.sumelectzpe: -553.790525 hartree
zpe.sumelectthermal: -553.778578 hartree
zpe.sumelectthermalent: -553.777634 hartree
zpe.sumelectthermalfe: -553.830596 hartree
dipole: -3.1924 0.0526 3.1493
dipole: 4.4847
quadrupole: -69.6104 -68.3746 -74.6242
quadrupole: 0.0958 11.0157 2.2279
quadrupole: 1.2593 2.4951 -3.7545 0.0958 11.0157 2.2279
hfenergy: -553.9730873 hartree
pointgroup: C01 [X(C9H11N1O2)]
dipole: -1.2490553 -0.4652718 1.1560755 debye
dipolederiv: -0.364685 -0.2427032 0.0848991 -0.3048505 -0.7026022 -0.0537539 0.2507819 0.0736809 -0.4073546 -0.3358213 -0.0019207 0.1549905 -0.0921018 -0.6115932 -0.0591678 0.2286358 -0.2544163 -0.5446636 0.3043236 0.3060378 -0.3440602 0.4359049 1.0313543 0.1366378 -0.5897971 0.1931659 0.7452734 0.3594757 -0.0681926 0.1565606 0.0548568 0.188081 -0.05534 0.0436681 -0.0675515 0.1947621 0.086664 -0.0036919 -0.0519418 0.0179244 -0.0802821 0.038253 0.0311 0.0528211 -0.1685136 -0.0073895 0.0282169 0.0702691 -0.065313 -0.0071514 0.1024966 0.0259031 0.091854 -0.0431372 -0.0199414 -0.0439412 -0.0140525 -0.0113346 -0.0467911 0.0538352 -0.0275653 0.0697781 -0.0679327 -0.0645089 0.034823 0.0026248 0.0246781 -0.0535774 0.0106387 0.0705805 0.0414134 -0.0001949 0.4450173 -0.0194977 0.0880749 -0.0157001 -0.0232103 -0.0034909 0.1208214 -0.0065821 -0.0003057 -0.1906092 -0.0688668 -0.0608282 -0.1381605 -0.0006519 0.0814392 -0.1322292 0.0967566 -0.0968922 -0.2040198 0.0577899 0.0460036 0.1481101 -0.0238506 0.135083 0.092041 0.1347853 -0.0377781 -0.1605376 0.0021798 -0.0501454 -0.0543043 0.0780053 0.0062602 -0.1285226 0.0150853 0.043606 0.0392833 -0.011544 0.0079801 -0.0577498 -0.0425565 -0.0558497 0.0066878 -0.0129157 -0.007336 0.0304289 -0.0680768 -0.0812571 -0.0570199 0.0404639 -0.0892125 -0.0606434 -0.0896669 0.0538582 0.0529514 0.0837477 0.0386494 0.0705934 0.0455014 -0.0541211 0.0550558 -0.0649722 0.0990584 0.1038124 -0.0359858 -0.050665 -0.0193556 0.0227083 -0.0449521 -0.0375705 -0.1148253 0.0222667 -0.1699661 0.031963 -0.0700715 0.0186467 0.0625121 0.017209 -0.0510008 0.0083889 0.0989721 0.0698102 -0.016503 0.0982521 -0.0355711 0.0758686 0.0429775 0.0896226 0.0516762 -0.0470573 -0.0030395 0.0965505 0.0474489 0.0953809 0.0141072 -0.0897377 0.035562 -0.0889876 0.0921216 0.0243442 -0.0565403 -0.0671372 -0.0588934 0.0316888 -0.1034428 -0.0732676 -0.104944 0.0489123 -0.0285277 -0.0502327 0.0055303 -0.1143572 -0.078266 0.0428084 0.0366902 0.0311288 0.1071174 0.0228143 0.0322569 0.0137907 0.1153139 -0.0212865 -0.0980665 0.0930539 -0.1104988 0.0246375 0.0101207 0.0141312 -0.0249151 0.0433026 0.101528 0.0394963 -0.0796074 0.054826 -0.1094196 unknown
polarizability: 146.4344856|-3.2733773|100.1767047|4.4788294|17.8325196|84.5165303 unknown
InChI: InChI=1S/C9H11NO2/c1-7-3-5-9(6-4-7)8(2)10(11)12/h3-6,8H,1-2H3
charge 0 multiplicity 1
23 atoms
O  2.927782 1.380061 -0.752534
O  2.574014 -0.725375 -1.552387
N  2.463102 0.186534 -0.652911
C  1.681879 -0.167766 0.653066
C  0.187879 -0.083602 0.365905
C  -0.587269 0.928185 0.980274
C  -0.453635 -1.006816 -0.499616
C  2.163499 -1.536174 1.161601
C  -2.628969 0.088966 -0.112145
C  -1.978683 1.008283 0.747892
C  -1.839842 -0.91683 -0.732893
C  -4.120968 0.178696 -0.37948
H  1.977671 0.639721 1.342685
H  -0.10416 1.656563 1.642878
H  0.134719 -1.779707 -1.006168
H  1.954625 -2.328843 0.425666
H  3.248433 -1.525779 1.365323
H  1.631241 -1.775032 2.098244
H  -2.563798 1.796465 1.236062
H  -2.320403 -1.633537 -1.410059
H  -4.626868 -0.781104 -0.165881
H  -4.597665 0.958117 0.238968
H  -4.321787 0.421875 -1.44009
