program: Gaussian 09
title: 000226096
version: EM64L-G09RevD.01
frameworkgroup: C1[X(C9H14N2O8)]
method: RPBEPBE
basis: SDD
operation: Freq
keyword: #p
keyword: freq=noraman
keyword: PBEPBE/SDD
title: #p freq=noraman PBEPBE/SDD
converged: YES YES NO NO
title: Mulliken charges:
elementType: O O O O O O O O N N C C C C C C C C C H H H H H H H H H H H H H H
charge: -0.264348 -0.251177 -0.207296 -0.245765 -0.159396 -0.170623 -0.176210 -0.190799 0.112065 0.155974 -0.477028 -0.313506 -0.067900 0.239298 0.258121 -0.260268 -0.261683 -0.663739 -0.662364 0.276250 0.292081 0.298460 0.373282 0.227101 0.236812 0.242671 0.233868 0.258174 0.245121 0.218338 0.229078 0.250476 0.224933
chargesum: 0.00000
title: Mulliken charges with hydrogens summed into heavy atoms:
elementType: O O O O O O O O N N C C C C C C C C C
charge: -0.264348 -0.251177 -0.207296 -0.245765 -0.159396 -0.170623 -0.176210 -0.190799 0.112065 0.155974 0.091302 -0.015045 0.305382 0.239298 0.258121 0.203644 0.214856 0.057894 0.042123
polarizability: 1.61168156e+02 5.88799238e+00 1.40126963e+02 -1.94728704e+00 -4.32752872e+00 1.19965707e+02
1716.lowfreq: -14.2819 -6.2229 -2.6370 -0.0007 -0.0006 -0.0003 9.8257 24.5388 32.2106
frequency: -4.8398 24.4591 31.9800 38.6613 49.4848 59.3510 66.4797 74.9102 80.3417 98.8050 108.6630 129.5246 171.1512 186.4559 200.8962 210.0522 233.3804 245.3924 278.6696 313.4068 320.3594 338.5238 389.2379 398.5035 435.6684 446.9200 504.0289 531.8260 565.6884 606.3885 636.9914 670.1716 686.7717 724.0733 747.6679 769.5773 789.2130 802.9002 814.0197 820.7155 839.7564 891.0925 892.6681 993.4785 1004.2913 1011.6357 1041.7401 1096.1272 1097.4960 1099.5982 1121.5566 1155.8197 1158.5378 1167.6533 1173.6874 1192.5051 1233.1289 1243.6124 1273.6908 1275.7131 1278.4815 1296.6342 1315.6975 1352.2912 1357.4192 1369.4246 1392.6499 1397.2587 1428.4007 1433.0863 1454.7911 1457.5614 1459.4228 1464.3330 1465.2089 1484.6747 1485.0605 1628.8762 1639.5075 2995.8473 2996.6363 3026.9734 3033.0416 3036.0767 3039.3797 3063.8474 3091.2729 3091.5737 3096.1850 3099.4696 3099.8418 3124.9299 3127.3625
redmass: 3.8656 8.2184 5.3680 7.2131 4.4580 4.1940 6.7784 8.2048 5.1285 4.5008 5.2705 4.4420 4.6662 6.2084 2.7038 1.3856 3.1837 2.4480 2.3219 3.2528 2.4342 5.4286 6.5959 6.4077 4.5477 4.1620 5.8839 7.2681 5.9030 7.4553 3.6014 6.1063 5.2707 4.2786 8.1330 3.2023 3.1471 1.6738 1.5989 3.7874 3.0562 7.0881 2.8715 2.2660 2.5546 2.7031 2.7151 2.2187 2.2027 2.9906 2.8372 1.6755 1.7131 2.6226 4.1980 2.2713 2.5760 1.9563 1.4280 1.1300 1.2354 1.3270 1.5852 1.2710 1.3433 1.5116 1.2319 1.2229 4.8034 7.8690 1.1091 1.0980 1.0926 1.0614 1.0457 1.0531 1.0538 8.5067 10.1606 1.0361 1.0368 1.0681 1.0597 1.0742 1.0600 1.0867 1.0973 1.0970 1.1015 1.1028 1.1038 1.1060 1.1074
irintensity: 0.4901 0.1103 0.1910 0.7562 0.7047 1.3368 1.0037 0.4742 0.2886 0.2743 1.4294 1.4712 2.4132 5.3941 10.5608 5.4752 4.4633 0.8792 6.4338 3.2980 0.4154 29.3327 4.5085 1.0186 12.3044 1.7171 8.1741 7.1418 9.6019 5.2830 3.2042 3.6092 4.4222 7.3817 29.0127 53.7517 7.1968 12.7716 14.3872 4.3193 6.7267 3.1092 0.6433 25.1729 29.5502 89.6580 151.6620 34.2911 26.1780 59.0412 328.2668 15.2849 14.0800 80.6103 164.0614 40.1851 57.6069 11.7692 39.0308 7.6026 39.2963 13.9584 65.0854 1.5738 10.6106 32.2187 21.5582 20.6700 177.2389 87.7384 6.6328 15.5957 14.0621 12.2745 14.5003 12.9028 28.3531 185.2519 149.1034 17.1240 10.9988 0.6507 30.2817 0.7791 20.0441 61.5497 28.5693 30.4890 1.1390 2.8519 0.4631 20.8875 25.6900
temp: 298.150 k
press: 1.00000 atm
elementType: 8 8 8 8 8 8 8 8 7 7 6 6 6 6 6 6 6 6 6 1 1 1 1 1 1 1 1 1 1 1 1 1 1
symmnumber: 1
zpe: 637898.6 jmol-1
zpe.correction: 0.242963 hartree
zpe.thermalcorrener: 0.263087 hartree
zpe.thermalcorrenthalpy: 0.264031 hartree
zpe.thermalcorrgfe: 0.191267 hartree
zpe.sumelectzpe: -1060.992163 hartree
zpe.sumelectthermal: -1060.972038 hartree
zpe.sumelectthermalent: -1060.971094 hartree
zpe.sumelectthermalfe: -1061.043858 hartree
dipole: 4.2109 -3.4849 -2.6761
dipole: 6.0859
quadrupole: -102.0210 -116.0097 -114.2813
quadrupole: 10.7544 2.6256 3.1730
quadrupole: 8.7497 -5.2391 -3.5106 10.7544 2.6256 3.1730
hfenergy: -1061.2351256 hartree
pointgroup: C01 [X(C9H14N2O8)]
dipole: -0.8481949 2.0232338 -0.9592636 debye
polarizability: 161.478977|-5.1376278|139.172017|4.5273272|4.0038212|120.6098319 unknown
InChI: InChI=1S/C9H14N2O8/c1-3-18-8(12)6(9(13)19-4-2)5-7(10(14)15)11(16)17/h6-7H,3-5H2,1-2H3
charge 0 multiplicity 1
33 atoms
O  1.813285 1.453227 -1.120492
O  -2.381223 1.8985 -0.453206
O  0.561838 2.026483 0.769576
O  -2.119009 -0.171525 0.584074
O  0.624948 -4.085314 0.163185
O  1.91738 -1.295748 1.46917
O  -0.809602 -3.495683 -1.508073
O  2.627675 -1.857414 -0.630803
N  0.017127 -3.229493 -0.567381
N  1.719042 -1.626819 0.246532
C  -0.034884 -0.810044 -1.412468
C  -0.435947 0.64416 -1.043834
C  0.257053 -1.723817 -0.218666
C  0.674698 1.445754 -0.330002
C  -1.720186 0.714614 -0.210449
C  3.00516 2.21485 -0.598701
C  -3.611309 2.172905 0.366813
C  3.868027 1.330744 0.301791
C  -4.848413 1.564373 -0.295859
H  -0.868825 -1.277288 -1.965247
H  0.843377 -0.790781 -2.080147
H  -0.623629 1.176476 -1.994738
H  -0.388532 -1.513853 0.651154
H  3.529057 2.512945 -1.520435
H  2.630743 3.104668 -0.063124
H  -3.445899 1.765204 1.378734
H  -3.649816 3.272664 0.399065
H  3.33298 1.053448 1.224765
H  4.174941 0.408319 -0.219467
H  4.780063 1.887211 0.587429
H  -4.968451 1.934778 -1.328374
H  -4.787415 0.463502 -0.311889
H  -5.749253 1.849356 0.278267
