program: Gaussian 09
title: 000226076
version: EM64L-G09RevD.01
frameworkgroup: C1[X(C7H11NO2)]
method: RPBEPBE
basis: SDD
operation: Freq
keyword: #p
keyword: freq=noraman
keyword: PBEPBE/SDD
title: #p freq=noraman PBEPBE/SDD
converged: YES YES NO NO
title: Mulliken charges:
elementType: O O N C C C C C C C H H H H H H H H H H H
charge: -0.210239 -0.207162 0.096914 -0.180639 -0.127805 -0.510613 -0.099998 -0.490277 -0.468579 -0.455612 0.273645 0.242720 0.260912 0.230098 0.271310 0.214399 0.266308 0.238561 0.216464 0.207229 0.232363
chargesum: 0.00000
title: Mulliken charges with hydrogens summed into heavy atoms:
elementType: O O N C C C C C C C
charge: -0.210239 -0.207162 0.096914 0.093006 0.114915 -0.019603 0.171312 -0.009570 -0.013554 -0.016019
polarizability: 9.37402836e+01 -2.10700734e+00 8.45152684e+01 -5.90240391e-01 -2.76568227e+00 7.02332572e+01
1716.lowfreq: -0.0004 -0.0002 0.0004 9.3171 18.0051 24.9585 46.0465 106.4525 190.7252
frequency: 43.7040 106.3715 190.7092 239.3073 320.2111 370.5176 425.0532 445.5253 577.7781 612.4481 677.4962 750.5616 764.2630 788.0404 815.0438 845.2900 884.8898 915.0445 926.1798 929.5732 955.8646 962.2741 966.5224 1020.0000 1051.6424 1057.1759 1117.7889 1131.7108 1149.7115 1167.6820 1196.2757 1205.4326 1225.1852 1249.6242 1265.5170 1270.6896 1277.5188 1295.0493 1298.4227 1315.2175 1320.9013 1419.5200 1453.4541 1471.3436 1473.0270 1493.9548 3000.9548 3015.1764 3020.4690 3022.6229 3054.7278 3074.4615 3075.9527 3078.8624 3087.4098 3093.1552 3096.3607
redmass: 8.1269 3.4768 5.0303 2.2805 3.5985 2.7595 3.4009 1.8198 3.9079 5.0499 5.2824 4.8907 3.2908 2.6020 1.9703 2.5542 2.4847 2.5548 1.7735 3.4723 2.1266 1.9019 1.7457 1.6888 1.5661 1.6673 1.0945 1.0976 1.6888 1.5034 2.0332 1.4766 2.5330 1.4949 1.4467 1.3801 1.4262 1.6617 1.5328 1.6137 1.5967 3.2485 1.1330 1.0997 1.0897 1.1083 1.0588 1.0621 1.0598 1.0604 1.1047 1.0912 1.0928 1.1004 1.0951 1.1001 1.1041
irintensity: 0.1661 2.0295 4.2321 1.3968 0.7012 0.0926 2.6084 0.0555 3.1444 6.0002 1.6808 11.8760 1.7599 9.0525 2.5207 10.1971 3.0025 5.9003 2.9107 2.4456 5.8925 0.2524 0.5755 0.8140 0.8518 4.0555 0.3359 2.7438 7.2096 1.6453 56.1530 1.4536 22.3756 9.1394 21.5153 9.9944 7.2180 7.2292 10.6123 4.0838 30.2597 109.3824 17.2698 10.1967 7.1214 4.6922 31.7924 55.7610 36.0424 6.8186 2.1634 39.0833 23.7282 24.5596 23.3415 25.0508 15.9694
temp: 298.150 k
press: 1.00000 atm
elementType: 8 8 7 6 6 6 6 6 6 6 1 1 1 1 1 1 1 1 1 1 1
symmnumber: 1
zpe: 460919.2 jmol-1
zpe.correction: 0.175555 hartree
zpe.thermalcorrener: 0.183861 hartree
zpe.thermalcorrenthalpy: 0.184805 hartree
zpe.thermalcorrgfe: 0.141786 hartree
zpe.sumelectzpe: -477.679313 hartree
zpe.sumelectthermal: -477.671006 hartree
zpe.sumelectthermalent: -477.670062 hartree
zpe.sumelectthermalfe: -477.713081 hartree
dipole: 4.4684 0.2425 -0.7887
dipole: 4.5439
quadrupole: -70.5008 -61.0504 -56.8846
quadrupole: 0.8023 1.8415 1.3128
quadrupole: -7.6889 1.7615 5.9273 0.8023 1.8415 1.3128
hfenergy: -477.8548674 hartree
pointgroup: C01 [X(C7H11N1O2)]
dipole: 1.7485994 -0.2632277 -0.2627239 debye
dipolederiv: -0.5183749 -0.0269123 0.1794149 0.1446664 -0.336939 0.1621255 0.0520223 0.272711 -0.6390016 -0.6593741 0.2032222 -0.1925548 0.2109618 -0.3733165 0.2473085 -0.0359709 0.1640398 -0.5258007 1.0303913 -0.2005911 -0.008931 -0.3732186 0.3443008 -0.4236065 -0.1372334 -0.4508464 0.8763502 0.1369043 0.0438891 0.0080789 0.1783725 0.1130278 0.0020988 0.1658393 -0.0090701 0.0414042 0.1355331 0.0081329 0.0226388 0.0174811 0.0766199 -0.0607463 0.025631 -0.0501975 0.1233424 0.0208113 0.032651 0.0190775 0.0124077 -0.0270228 0.0057271 0.0006683 0.0095635 -0.0632048 -0.0816411 -0.0377905 0.0348592 -0.1249815 0.1493259 0.0259878 0.0031611 0.0481881 0.1247937 -0.0489767 -0.014997 -0.0155855 -0.0414999 -0.0012001 0.0711444 0.0226718 0.0489595 0.0433277 -0.0021481 0.0552835 0.0175977 -0.0593056 0.0612029 0.0341371 -0.0247164 0.0201297 0.0912089 0.0644759 -0.0189708 0.0496308 0.0008867 0.0365266 0.0669463 0.0425447 0.0701369 0.0494087 0.0003834 0.086576 -0.0113219 0.0636519 -0.0939168 0.0122007 -0.01685 0.023099 0.0645341 0.0071096 0.0517152 -0.0515486 0.0552935 -0.0450813 0.111883 -0.0656495 0.1155636 -0.0368739 -0.0178686 0.0080556 0.1329824 0.0019644 0.0738146 0.0290293 0.1015322 0.0004139 0.0002981 -0.0531916 -0.106452 -0.1122258 -0.0779564 -0.0081014 -0.0749563 -0.0691889 -0.0515134 0.040122 0.0024504 0.0213817 -0.0282115 0.0531111 0.0623056 0.0106517 -0.0226162 -0.007973 -0.0699112 0.0445404 0.0624828 0.0113372 0.0394417 -0.0380224 -0.0894797 -0.007083 -0.1433425 -0.0389681 0.0250076 -0.0857723 0.0524133 -0.0401171 0.0677774 0.0104206 0.0415126 0.070622 0.040655 -0.0542905 -0.1073925 0.0011545 -0.0887695 -0.094912 0.0126079 -0.015321 -0.0336978 0.0709418 0.068078 0.0190957 -0.0555057 0.015297 0.0593288 -0.0291043 -0.0171873 0.0230766 -0.1729091 0.0559522 0.0249574 0.0170131 0.0748124 -0.0684293 -0.1051288 0.0661142 -0.1192489 -0.0540699 -0.1557718 -0.0185648 -0.0703136 -0.0624997 0.0427112 -0.0192471 -0.1098811 -0.0006139 0.0343525 unknown
polarizability: 93.3607613|-3.0900082|75.4887793|0.7240276|-7.4266452|79.6392687 unknown
InChI: InChI=1S/C7H11NO2/c9-8(10)7-4-5-1-2-6(7)3-5/h5-7H,1-4H2
charge 0 multiplicity 1
21 atoms
O  -2.292031 -0.345689 0.988978
O  -2.637343 0.848559 -0.920042
N  -1.907403 0.119327 -0.14848
C  0.467697 1.010285 -0.110873
C  1.418893 -0.88069 0.744994
C  0.88841 0.477803 1.28896
C  -0.466056 -0.138096 -0.623975
C  0.163051 -1.422694 -0.005178
C  1.795828 0.876625 -0.919769
C  2.463302 -0.414668 -0.313568
H  0.004556 2.007915 -0.162899
H  1.81649 -1.583219 1.494208
H  0.04528 0.368473 1.991653
H  1.67675 1.095021 1.754102
H  -0.550225 -0.137475 -1.721812
H  0.415082 -2.166526 -0.780232
H  -0.549478 -1.87849 0.703706
H  2.423949 1.769296 -0.751961
H  1.617591 0.799657 -2.007385
H  2.653051 -1.19171 -1.07577
H  3.429705 -0.175803 0.165439
