program: Gaussian 09
title: 000226071
version: EM64L-G09RevD.01
frameworkgroup: C1[X(C5H7ClN2O4S)]
method: RPBEPBE
basis: SDD
operation: Freq
keyword: #p
keyword: freq=noraman
keyword: PBEPBE/SDD
title: #p freq=noraman PBEPBE/SDD
converged: YES YES NO NO
title: Mulliken charges:
elementType: Cl S O O O O N N C C C C C H H H H H H H
charge: -0.195403 0.928278 -0.192396 -0.461851 -0.455132 -0.211006 -0.403850 -0.395572 -0.164787 -0.302479 -0.643325 0.174504 0.198610 0.279473 0.257747 0.276959 0.298920 0.304828 0.341112 0.365369
chargesum: 0.00000
title: Mulliken charges with hydrogens summed into heavy atoms:
elementType: Cl S O O O O N N C C C C C
charge: -0.195403 0.928278 -0.192396 -0.461851 -0.455132 -0.211006 -0.062738 -0.030203 0.114687 0.232227 -0.039577 0.174504 0.198610
polarizability: 1.83035759e+02 -8.36049311e+00 1.27983366e+02 -1.35349088e+01 4.23335770e-01 8.45582654e+01
1716.lowfreq: -14.4435 -0.0013 0.0002 0.0015 0.8755 2.3102 12.4736 32.3920 56.2157
frequency: 9.4081 32.3131 56.2003 73.0244 112.9328 133.3588 161.4794 164.9450 165.8338 227.0024 236.1389 276.2072 347.0876 381.0600 403.3222 453.1110 476.1081 534.0241 595.7546 602.3400 631.7793 668.0199 692.7564 728.2342 785.9377 834.0386 858.0588 931.6034 954.5092 967.9261 1047.1151 1062.2078 1092.4187 1157.2151 1173.9567 1211.7030 1258.7760 1272.5358 1303.5889 1316.8109 1333.3210 1340.6219 1373.7534 1411.2940 1467.8695 1690.2455 1732.9282 2989.1551 3012.8982 3051.5835 3083.6438 3144.3021 3587.1855 3604.1774
redmass: 12.1984 8.4188 9.6762 4.5427 7.8728 4.8925 4.7411 10.9208 7.2438 18.9969 4.1305 5.2023 10.3538 9.6087 6.6146 4.6672 1.2281 5.4036 4.0914 10.8666 2.3771 1.7854 4.8180 5.4930 1.3169 11.6679 4.2835 3.5584 3.3839 3.8625 2.8826 2.7226 2.2980 1.2205 3.1797 1.5761 1.4317 1.2317 1.9235 1.6881 1.2617 1.9074 1.6341 1.1128 1.0937 8.5554 9.6332 1.0836 1.0600 1.0561 1.1049 1.1111 1.0804 1.0801
irintensity: 0.7353 3.7749 3.6401 0.4114 0.4653 2.9586 1.0941 1.1993 9.2975 0.1174 1.3424 36.6762 45.6880 28.3288 38.6772 30.7408 128.0812 6.6043 2.1977 15.2548 55.8791 71.1176 3.5696 80.0657 11.0390 49.7171 47.9264 37.5686 7.7367 31.2222 9.5999 9.8317 28.0083 14.4544 60.8650 92.7481 107.6697 2.5169 99.7864 8.7383 33.4091 98.5882 4.8237 5.1530 12.5107 582.9519 376.6767 13.6429 0.6199 2.0633 4.1761 0.0214 104.7267 38.7924
temp: 298.150 k
press: 1.00000 atm
elementType: 17 16 8 8 8 8 7 7 6 6 6 6 6 1 1 1 1 1 1 1
symmnumber: 1
zpe: 348196.0 jmol-1
zpe.correction: 0.132621 hartree
zpe.thermalcorrener: 0.146666 hartree
zpe.thermalcorrenthalpy: 0.147610 hartree
zpe.thermalcorrgfe: 0.088018 hartree
zpe.sumelectzpe: -1462.137968 hartree
zpe.sumelectthermal: -1462.123923 hartree
zpe.sumelectthermalent: -1462.122979 hartree
zpe.sumelectthermalfe: -1462.182571 hartree
dipole: -3.2776 -1.2777 -2.6839
dipole: 4.4247
quadrupole: -113.7409 -106.2424 -91.9114
quadrupole: -7.3708 -0.9962 5.0894
quadrupole: -9.7760 -2.2775 12.0535 -7.3708 -0.9962 5.0894
hfenergy: -1462.2705885 hartree
pointgroup: C01 [X(C5H7Cl1N2O4S1)]
dipole: -1.3398301 0.2108147 1.0912443 debye
dipolederiv: -0.5739406 -0.1706827 -0.1040942 -0.3953916 -0.499902 -0.1856179 -0.2829327 -0.2141029 -0.3872774 1.211902 0.1422922 0.1393013 0.1528275 1.2758141 0.190693 0.09954 0.1906253 1.204128 -0.492182 0.0056369 -0.044154 -0.057678 -1.1395299 -0.0531021 -0.0990118 -0.1257585 -0.3533172 -0.5108474 -0.0046667 -0.0605457 0.0821802 -0.3882072 0.0302007 0.1389392 -0.0110099 -0.5731372 -0.5113347 -0.0046489 0.0156635 0.1674425 -0.5500974 -0.0295779 0.1078064 0.0580193 -0.4133163 -0.9082895 0.3393285 -0.1245901 0.5983857 -0.9583281 0.0838151 -0.1737815 0.0591304 -0.391962 -1.1915011 0.0859668 -0.1420395 0.240287 -0.4529633 0.0566668 -0.1305293 0.0436365 -0.5299173 -0.7823192 0.3727928 -0.0380915 0.2189763 -1.347806 -0.0629984 -0.1880234 0.0201001 -0.3732613 0.0040606 -0.3250164 -0.1742285 -0.8135065 0.2448236 -0.1734118 -0.6178733 -0.173522 0.274532 -0.3527105 0.0356397 0.0262828 0.074999 0.0100943 -0.0325016 0.319512 -0.0085651 -0.0155017 0.6447968 0.0762931 -0.0169808 0.0815983 -0.0300167 -0.0086889 -0.0987344 -0.0574767 -0.0116874 1.1173871 -0.4080069 0.2275724 -0.0019697 1.5769076 0.0601683 0.5758266 0.0418331 0.3253477 1.6336161 -0.2619718 0.4262452 -0.5564671 1.7709479 0.0437845 0.5601067 0.1053012 0.5014931 0.0440947 0.0426645 -0.0371036 0.0715441 0.0109308 0.0389474 -0.0022363 0.0570707 -0.0622924 0.0694373 -0.0029139 0.006838 -0.0249822 0.0740853 0.0478995 -0.0393506 0.0316838 -0.0239221 0.1011015 0.0446295 -0.0068267 0.0512399 -0.0028271 0.007303 -0.0224184 0.0042206 0.0981482 -0.0216267 0.0031985 0.0172225 -0.0256908 -0.0120433 -0.0085069 0.0474958 0.0032463 0.0744351 -0.0280958 -0.0069602 0.0135716 0.0252483 0.0757414 0.0188251 -0.0137497 0.011584 -0.0003989 0.2554695 0.0165998 -0.0824864 0.0284287 0.1713071 -0.0129297 -0.1398545 -0.0141783 0.3130248 0.2909818 0.0198251 -0.041556 0.0825284 0.171069 -0.0109684 -0.0407307 -0.0218379 0.3448822 unknown
polarizability: 181.2440112|7.9273581|126.6927173|17.7151688|10.094817|87.6406617 unknown
InChI: InChI=1S/C5H7N2O4S.Cl/c8-4-3(1-2-12(10)11)6-5(9)7-4;/h3,6-7H,1-2H2;
charge 0 multiplicity 1
20 atoms
Cl 4.448039 1.532869 0.989572
S  3.184153 -0.116282 -0.269823
O  -2.05002 -2.413579 -0.176391
O  3.073347 0.357176 -1.81172
O  3.712696 -1.598491 0.10081
O  -3.562021 2.057991 -0.199273
N  -1.550546 1.042116 0.57918
N  -3.102925 -0.287577 -0.353689
C  -0.983213 -0.308323 0.674626
C  0.362989 -0.52796 -0.075466
C  1.488523 0.221231 0.629647
C  -2.092781 -1.177729 0.006925
C  -2.816796 1.074837 -0.007752
H  -0.876908 -0.636127 1.728404
H  0.258865 -0.180913 -1.119056
H  0.551841 -1.617674 -0.08591
H  1.424667 1.319173 0.570133
H  1.70586 -0.116107 1.656054
H  -1.160216 1.879789 1.006985
H  -3.968455 -0.553121 -0.824956
