program: Gaussian 09
title: 000226094
version: EM64L-G09RevD.01
frameworkgroup: C1[X(C9H9N3O6S)]
method: RPBEPBE
basis: SDD
operation: Freq
keyword: #p
keyword: freq=noraman
keyword: PBEPBE/SDD
title: #p freq=noraman PBEPBE/SDD
converged: YES YES NO NO
title: Mulliken charges:
elementType: S O O O O O O N N N C C C C C C C C C H H H H H H H H H
charge: 0.457343 -0.167444 -0.194313 -0.136099 -0.147018 -0.191104 -0.180366 0.145321 0.154675 0.010498 -0.165525 -0.380573 -0.653570 -0.336221 0.428816 -0.157642 -0.336617 -0.262395 -0.204064 0.262121 0.267135 0.234764 0.234261 0.234904 0.287129 0.292336 0.252062 0.251585
chargesum: 0.00000
title: Mulliken charges with hydrogens summed into heavy atoms:
elementType: S O O O O O O N N N C C C C C C C C C
charge: 0.457343 -0.167444 -0.194313 -0.136099 -0.147018 -0.191104 -0.180366 0.145321 0.154675 0.010498 -0.165525 0.148683 0.050360 -0.336221 0.428816 0.129488 -0.044282 -0.010333 0.047522
polarizability: 2.36888946e+02 4.91542865e+00 1.81886587e+02 -1.19020381e+01 1.22350180e+01 1.02909026e+02
1716.lowfreq: -11.4586 -3.9068 0.0013 0.0017 0.0019 0.4212 15.3981 38.4455 58.0570
frequency: 15.1644 38.3805 58.0555 72.8999 86.0993 91.1306 111.3221 136.4618 145.6739 161.0308 190.0217 202.1417 206.0274 226.9501 230.4897 283.1231 311.6180 335.3731 347.3081 385.8959 399.6794 430.5810 439.7626 482.4635 493.6754 537.0258 553.0403 620.1152 640.5003 662.5322 677.5599 689.7687 719.4174 728.5584 755.3967 787.5651 789.1509 795.8503 825.9768 892.0061 957.9425 980.4088 1004.1491 1017.3350 1043.1228 1069.6423 1101.7210 1108.1158 1127.0750 1143.3915 1163.2679 1183.4100 1204.1328 1209.9411 1267.1732 1278.2156 1318.0521 1354.6823 1379.9590 1400.5455 1409.5667 1424.2379 1428.7354 1451.3862 1455.6773 1475.9442 1483.7700 1571.8756 1591.7923 2999.2251 3024.2060 3083.1960 3101.3407 3106.4742 3149.3962 3166.0781 3175.6350 3186.4554
redmass: 7.2825 7.1866 12.6591 4.6236 4.0075 7.8057 8.7388 5.1467 10.1676 6.0726 3.9722 2.2758 2.7328 7.3935 6.6092 5.2085 3.1382 5.5547 9.3950 12.1651 10.5104 4.3029 10.0224 4.6827 5.2663 6.3024 7.1201 6.1746 7.0381 5.8062 8.4051 5.1054 3.6278 6.0926 5.9687 1.4534 7.8005 6.9115 1.6415 1.3126 2.1067 1.3579 1.3426 7.1602 2.9865 2.8871 2.2833 1.8019 2.9699 1.9894 13.0530 1.1365 7.8225 10.4162 1.1712 1.4242 1.4088 9.8598 5.7299 1.2049 11.9503 2.7414 3.7406 1.2695 2.1276 1.0538 1.0525 6.3523 6.1004 1.0361 1.0632 1.0985 1.0991 1.1008 1.0875 1.0905 1.0947 1.0997
irintensity: 0.7837 1.9264 0.2307 0.1129 0.0275 0.2542 1.1210 1.1467 0.5277 4.3107 4.5408 0.1530 0.9757 16.0069 0.4078 1.0741 0.9730 2.2354 1.6177 2.7328 1.2675 3.1560 0.8243 7.3643 3.5373 0.9559 0.8948 0.4412 3.4873 9.2595 10.3099 13.5841 23.5593 13.3908 55.9644 58.2606 10.4507 29.7858 18.1375 0.3923 13.4240 3.1297 0.4445 22.6324 3.0905 2.6145 15.5396 3.6941 9.2684 8.6491 102.2504 4.5150 126.1947 204.7168 4.0479 5.3702 11.5231 193.6538 6.9429 17.9299 161.3272 14.4519 110.4039 7.9505 61.5958 9.2221 15.9592 20.9747 21.9445 14.1192 1.7231 2.4590 14.2418 18.1002 5.1151 1.5161 9.8262 8.7658
temp: 298.150 k
press: 1.00000 atm
elementType: 16 8 8 8 8 8 8 7 7 7 6 6 6 6 6 6 6 6 6 1 1 1 1 1 1 1 1 1
symmnumber: 1
zpe: 485403.1 jmol-1
zpe.correction: 0.184880 hartree
zpe.thermalcorrener: 0.203415 hartree
zpe.thermalcorrenthalpy: 0.204359 hartree
zpe.thermalcorrgfe: 0.136508 hartree
zpe.sumelectzpe: -1360.325736 hartree
zpe.sumelectthermal: -1360.307202 hartree
zpe.sumelectthermalent: -1360.306258 hartree
zpe.sumelectthermalfe: -1360.374108 hartree
dipole: -3.4682 5.1543 3.8039
dipole: 7.2845
quadrupole: -125.9155 -124.1618 -116.6555
quadrupole: -14.4474 5.1885 0.8949
quadrupole: -3.6712 -1.9176 5.5888 -14.4474 5.1885 0.8949
hfenergy: -1360.5106166 hartree
pointgroup: C01 [X(C9H9N3O6S1)]
dipole: -1.8000114 -2.1974689 0.380412 debye
polarizability: 222.6687448|13.2011214|133.6997473|33.3609429|-39.1124243|165.3160661 unknown
InChI: InChI=1S/C9H9N3O6S/c1-2-9(11(15)16,12(17)18)19-8-6-4-3-5-7(8)10(13)14/h3-6H,2H2,1H3
charge 0 multiplicity 1
28 atoms
S  0.523262 0.792003 -0.153377
O  4.141866 -0.586158 0.794115
O  1.247621 -1.095272 3.015721
O  3.261107 1.017511 -0.569698
O  2.243459 0.929943 2.671653
O  -2.875926 1.121236 -2.902788
O  -0.973407 1.927602 -1.932714
N  3.169969 0.063044 0.2693
N  1.758662 -0.181047 2.268558
N  -2.010179 1.141115 -1.948796
C  1.736152 -0.433585 0.718358
C  1.608859 -1.917858 0.371359
C  1.804281 -2.207616 -1.132832
C  -1.130446 0.001603 0.127849
C  -2.189924 0.241595 -0.797893
C  -1.426088 -0.813808 1.249092
C  -3.468525 -0.344935 -0.644361
C  -2.702594 -1.391974 1.411011
C  -3.727495 -1.170268 0.461226
H  0.620505 -2.275736 0.700133
H  2.364081 -2.461102 0.968768
H  2.81931 -1.942755 -1.477586
H  1.075538 -1.659763 -1.75431
H  1.664334 -3.287475 -1.310685
H  -0.678235 -0.993753 2.024711
H  -4.229456 -0.124641 -1.398087
H  -2.894726 -2.008153 2.295375
H  -4.716506 -1.618454 0.593196
