program: Gaussian 09
title: 000226106
version: EM64L-G09RevD.01
frameworkgroup: C1[X(C22H25NO2)]
method: RPBEPBE
basis: SDD
operation: Freq
keyword: #p
keyword: freq=noraman
keyword: PBEPBE/SDD
title: #p freq=noraman PBEPBE/SDD
converged: YES YES NO NO
title: Mulliken charges:
elementType: O O N C C C C C C C C C C C C C C C C C C C C C C H H H H H H H H H H H H H H H H H H H H H H H H H
charge: -0.305916 -0.197773 -0.413071 -0.362773 -0.379235 -0.444672 -0.371065 -0.379019 -0.353828 0.302429 -0.355982 0.049457 0.336067 -0.109403 0.286321 0.262299 -0.268941 -0.367384 -0.695909 -0.435410 -0.224355 -0.383944 -0.378979 -0.228066 -0.229642 0.192501 0.192598 0.194330 0.194409 0.216119 0.216084 0.189374 0.189459 0.218800 0.218841 0.188846 0.188909 0.194908 0.194863 0.387050 0.253237 0.210163 0.215954 0.210156 0.292142 0.233552 0.291413 0.290154 0.236964 0.237968
chargesum: 0.00000
title: Mulliken charges with hydrogens summed into heavy atoms:
elementType: O O N C C C C C C C C C C C C C C C C C C C C C C
charge: -0.305916 -0.197773 -0.026021 0.022326 0.009503 -0.012469 0.007767 0.058622 0.023928 0.302429 0.033788 0.049457 0.336067 -0.109403 0.286321 0.262299 -0.268941 -0.114146 -0.059636 -0.143268 0.009197 -0.092530 -0.088825 0.008899 0.008326
polarizability: 3.92433597e+02 -3.91153677e+01 3.15102855e+02 -4.75218169e-02 -2.81561795e-02 1.30840217e+02
1716.lowfreq: -53.9559 -12.4813 -4.8095 -3.4658 -0.0012 -0.0010 0.0003 14.0381 20.3127
frequency: -51.6328 12.9829 20.1749 21.9958 49.9159 59.0904 71.4764 77.6568 92.7262 118.9131 125.1389 133.4742 140.6529 161.4577 173.6180 174.8722 207.5148 227.1507 232.7060 283.7933 284.4325 324.6690 328.7948 353.1999 397.6527 410.7628 421.4701 425.4507 436.0050 464.9110 479.5182 490.9590 510.3779 548.9417 599.9139 623.2783 660.6606 665.7790 686.1589 717.2002 717.7313 725.3561 733.4789 747.8098 777.4484 788.7558 798.6708 809.0226 832.8352 859.5505 863.1096 866.9393 888.1694 907.1826 914.6509 938.6041 945.1568 980.5218 992.0304 993.2227 997.3731 1010.0314 1013.7901 1018.6647 1034.8624 1049.6405 1069.8610 1076.4692 1081.1558 1081.9826 1085.1855 1109.8550 1131.3962 1151.9671 1160.8698 1168.6948 1182.2776 1188.8529 1200.4856 1218.1893 1226.9253 1247.5291 1261.7181 1261.8326 1279.6987 1284.4762 1287.8861 1292.6013 1295.2818 1301.0704 1304.6698 1328.2008 1342.3324 1351.8748 1355.3516 1366.7892 1386.7754 1391.6416 1394.8498 1418.3769 1431.3530 1447.3959 1458.4790 1458.6044 1463.3289 1467.3578 1470.7602 1473.9899 1477.3347 1480.6468 1486.4096 1489.2297 1503.0935 1534.0843 1548.5504 1581.3264 1590.5078 1609.9688 1619.7847 2930.8954 2949.1106 2951.5487 2953.6055 2960.7331 2966.8417 2971.4095 2972.2436 2974.7042 2983.2576 2991.7021 3003.4715 3020.2840 3034.3898 3046.3207 3067.6762 3070.5087 3134.4884 3137.7378 3150.7699 3163.2461 3165.6757 3171.7115 3174.3222 3216.7706
redmass: 1.5805 3.8550 4.6651 3.3644 3.7681 2.8668 4.1980 2.5720 2.7623 2.4482 2.3010 3.0046 4.5744 4.2026 4.8517 4.3487 4.2794 4.3125 1.1069 4.0009 5.1359 4.5249 6.2156 5.6814 4.6622 11.5162 3.5504 4.8101 4.3266 6.0834 4.3795 3.7199 4.0630 4.2337 6.9055 6.1554 3.7928 6.5379 6.6322 2.6194 1.0683 1.0879 2.1988 1.1266 6.6310 1.2990 1.5170 1.7038 1.1955 1.2820 6.9554 2.1473 1.9176 6.5858 1.3772 1.2147 2.0667 5.6429 4.3981 1.3576 1.4027 1.1112 1.3654 3.8052 2.1476 3.1073 2.7046 2.1350 2.4670 2.0703 2.4757 2.5248 3.5919 1.5296 2.1255 1.1607 1.4242 1.6453 1.6079 1.3330 1.3732 1.6600 1.3327 1.2528 1.0256 1.1300 1.8855 1.0940 1.1093 2.6805 1.5677 1.6989 1.7735 1.6709 1.6527 1.6508 1.2154 3.6680 6.4517 5.1179 4.1883 2.8693 1.0737 1.0714 1.0692 1.0837 2.6824 1.0870 1.0426 1.0916 1.0923 1.1499 3.9994 4.9325 4.4165 4.7762 3.5621 6.6370 7.3374 1.0568 1.0585 1.0584 1.0590 1.0590 1.0585 1.0364 1.1025 1.0585 1.0967 1.0990 1.1021 1.1043 1.1048 1.1048 1.1007 1.0992 1.0862 1.0874 1.0905 1.0946 1.0915 1.0996 1.0977 1.0817
irintensity: 0.0850 0.0173 0.0529 0.2003 4.8163 1.5189 0.0134 0.3191 0.0309 0.0097 0.0000 0.0098 0.4113 0.2491 0.4430 1.7488 0.0711 0.4231 0.0001 1.8453 0.0727 1.6505 1.2585 2.1693 11.4310 12.2741 0.7474 0.3258 0.6029 2.3901 1.2224 1.6387 3.8319 7.4025 2.8935 0.4278 6.9435 7.0767 6.8491 52.7663 9.5006 0.2705 17.3478 6.0977 1.1435 6.4975 6.9273 113.1767 40.6657 2.5888 17.5939 2.6239 2.5592 1.4385 3.1786 0.3761 1.3182 51.2137 0.0864 0.1209 6.5775 0.2555 0.0003 4.6711 1.5680 1.5953 1.6822 11.8106 0.1160 0.5591 3.1565 7.7567 12.3555 0.1405 1.7601 4.4479 16.4467 0.0559 1.7278 17.6393 0.0211 5.1946 2.7900 0.2194 0.0635 0.8235 114.7095 0.1266 0.0114 252.8839 51.9617 194.0058 120.6390 7.5636 14.4327 17.0560 11.5722 30.5866 11.5534 12.8033 12.0569 0.2765 0.1428 0.3637 2.3660 5.7803 4.3507 19.0885 12.4633 10.2519 30.2101 62.3284 66.7409 183.5206 128.0887 34.0155 225.8942 39.5292 74.8459 67.5569 0.0701 5.4954 0.0278 22.0736 116.4555 36.3724 22.1660 67.8794 0.1212 0.0809 0.0427 0.8725 33.2260 158.0115 95.6904 55.1263 4.1274 13.6506 9.9380 3.2279 5.5817 39.6454 9.3370 46.3215
temp: 298.150 k
press: 1.00000 atm
elementType: 8 8 7 6 6 6 6 6 6 6 6 6 6 6 6 6 6 6 6 6 6 6 6 6 6 1 1 1 1 1 1 1 1 1 1 1 1 1 1 1 1 1 1 1 1 1 1 1 1 1
symmnumber: 1
zpe: 1091370.0 jmol-1
zpe.correction: 0.415681 hartree
zpe.thermalcorrener: 0.438877 hartree
zpe.thermalcorrenthalpy: 0.439821 hartree
zpe.thermalcorrgfe: 0.359682 hartree
zpe.sumelectzpe: -1056.764591 hartree
zpe.sumelectthermal: -1056.741396 hartree
zpe.sumelectthermalent: -1056.740451 hartree
zpe.sumelectthermalfe: -1056.820590 hartree
dipole: -3.7933 -0.1129 0.0016
dipole: 3.7949
quadrupole: -153.0362 -136.7349 -152.4305
quadrupole: -18.2686 -0.0015 -0.0046
quadrupole: -5.6357 10.6656 -5.0299 -18.2686 -0.0015 -0.0046
hfenergy: -1057.1802723 hartree
pointgroup: C01 [X(C22H25N1O2)]
dipole: 1.4915117 -0.0675822 -0.0003189 debye
polarizability: 393.6288831|37.8964555|313.9067662|0.1005649|0.3866786|130.8410198 unknown
InChI: InChI=1S/C22H25NO2/c1-2-3-4-5-6-9-15-23-19-14-10-13-18-20(19)22(25)17-12-8-7-11-16(17)21(18)24/h7-8,10-14,23H,2-6,9,15H2,1H3
charge 0 multiplicity 1
50 atoms
O  -0.896451 -1.512036 -0.004375
O  -5.461296 1.60591 0.002609
N  0.599159 0.633565 0.000165
C  4.451224 0.639227 -0.000662
C  5.527946 -0.468881 -0.000626
C  3.010889 0.082236 -0.000843
C  6.970077 0.086571 -0.000714
C  1.952339 1.202216 0.000665
C  8.052113 -1.016488 0.001437
C  -0.557726 1.370784 0.001774
C  9.493402 -0.457292 0.000995
C  -1.853517 0.710961 0.00108
C  -3.042791 1.515599 0.003007
C  -1.946204 -0.752192 -0.00173
C  -3.297751 -1.386057 -0.003603
C  -4.483994 -0.597812 -0.001656
C  -4.405864 0.891872 0.002689
C  -0.518975 2.807234 0.004205
C  10.570742 -1.563148 0.004593
C  -2.967331 2.921475 0.005447
C  -1.701214 3.55752 0.005991
C  -3.397918 -2.799732 -0.00753
C  -5.752136 -1.230422 -0.003691
C  -4.662047 -3.421959 -0.009517
C  -5.843313 -2.635825 -0.007602
H  4.596424 1.288162 0.888257
H  4.596575 1.28844 -0.88935
H  5.385625 -1.119142 0.887548
H  5.385565 -1.119426 -0.888576
H  2.861138 -0.560624 -0.891436
H  2.861649 -0.562444 0.888521
H  7.11152 0.738902 0.886634
H  7.112407 0.73649 -0.889681
H  2.09847 1.846991 0.894007
H  2.098206 1.849248 -0.891099
H  7.913169 -1.666798 0.890518
H  7.913772 -1.669845 -0.885502
H  9.631341 0.191835 -0.887927
H  9.630105 0.196317 0.886826
H  0.451946 -0.395958 -0.001438
H  0.447249 3.319109 0.00466
H  10.476144 -2.212264 -0.886505
H  11.590407 -1.135842 0.00407
H  10.475028 -2.207439 0.899061
H  -3.899933 3.492428 0.006898
H  -1.642342 4.651462 0.00785
H  -2.471159 -3.381333 -0.008956
H  -6.644219 -0.596106 -0.002084
H  -4.733484 -4.515022 -0.012556
H  -6.824562 -3.12237 -0.009153
