program: Gaussian 09
title: 000226047
version: EM64L-G09RevD.01
frameworkgroup: C1[X(C11H8ClNO2)]
method: RPBEPBE
basis: SDD
operation: Freq
keyword: #p
keyword: freq=noraman
keyword: PBEPBE/SDD
title: #p freq=noraman PBEPBE/SDD
converged: NO YES NO NO
title: Mulliken charges:
elementType: Cl O O N C C C C C C C C C C C H H H H H H H H
charge: -0.072351 -0.201513 -0.212637 0.015397 0.271141 0.252260 0.434956 0.222662 -0.385589 -0.377129 -0.415187 -0.237029 -0.383407 -0.242881 -0.819366 0.271352 0.301692 0.243416 0.240798 0.288034 0.243885 0.286228 0.275269
chargesum: 0.00000
title: Mulliken charges with hydrogens summed into heavy atoms:
elementType: Cl O O N C C C C C C C C C C C
charge: -0.072351 -0.201513 -0.212637 0.015397 0.271141 0.252260 0.434956 0.222662 -0.114237 -0.075437 -0.171771 0.003768 -0.095374 0.001004 -0.257869
polarizability: 2.07752419e+02 6.32752328e+00 1.76002972e+02 -7.31423531e+00 4.74221351e-01 7.00295994e+01
1716.lowfreq: -2.4209 0.0007 0.0014 0.0020 5.8873 10.0761 43.4501 48.2083 66.6049
frequency: 43.4498 48.1874 66.5976 113.1751 179.9849 195.2753 217.2407 265.7077 306.6992 356.0028 384.2965 433.1885 465.9222 483.3989 504.0392 534.8789 567.3128 590.0864 605.6155 660.4405 711.1843 717.7685 743.7968 781.6893 810.0208 832.4361 838.3487 868.0026 911.4392 939.0047 945.9734 994.4080 1000.5117 1064.1215 1082.3301 1109.0371 1133.1235 1172.9668 1192.4135 1198.5581 1204.3982 1249.4016 1252.3441 1265.8193 1353.9587 1374.7013 1397.8476 1414.5786 1434.3844 1453.5059 1473.1436 1520.6611 1582.6297 1594.2466 1624.4760 3068.5618 3134.6417 3146.5619 3153.3500 3159.0945 3172.8221 3187.4213 3207.4540
redmass: 13.2851 10.4744 8.0661 7.5283 4.0674 4.8102 6.6959 4.4876 4.1259 8.4281 5.2845 5.0821 3.2415 4.3773 5.9161 5.7124 6.2741 3.7842 6.0517 5.8572 4.9577 9.1413 1.8260 5.2696 1.3122 2.6176 5.9508 4.1825 1.7150 1.4338 1.4062 1.3704 1.3581 2.7066 2.3581 2.5082 1.1565 1.5314 1.5308 2.7779 1.8824 1.1978 1.8409 1.9991 5.8669 2.5108 5.0195 3.3189 3.2423 2.2501 1.1511 4.2361 7.5825 5.4797 6.8590 1.0582 1.0895 1.1090 1.0880 1.0950 1.0941 1.0969 1.0941
irintensity: 0.5472 2.7373 3.1501 2.7607 1.9843 0.8742 1.8131 1.9290 3.3966 1.7483 2.3263 3.8149 1.2434 0.7785 13.3985 31.1873 1.5699 2.9009 48.3246 7.5725 13.1285 10.5817 0.6175 1.4587 110.0678 6.3135 12.5600 20.2835 3.2019 0.5707 0.7899 1.4048 2.6158 5.1411 8.3942 1.8715 4.2676 30.3283 77.7085 208.4152 36.9375 18.7666 32.0201 45.0145 80.3296 7.5365 27.6613 0.2840 5.8494 1.4170 17.2378 43.0065 5.0241 3.0518 4.1542 18.8200 8.6709 5.0067 2.2333 16.3000 6.8400 3.8619 7.8431
temp: 298.150 k
press: 1.00000 atm
elementType: 17 8 8 7 6 6 6 6 6 6 6 6 6 6 6 1 1 1 1 1 1 1 1
symmnumber: 1
zpe: 433614.2 jmol-1
zpe.correction: 0.165155 hartree
zpe.thermalcorrener: 0.177415 hartree
zpe.thermalcorrenthalpy: 0.178359 hartree
zpe.thermalcorrgfe: 0.125129 hartree
zpe.sumelectzpe: -1088.108953 hartree
zpe.sumelectthermal: -1088.096693 hartree
zpe.sumelectthermalent: -1088.095749 hartree
zpe.sumelectthermalfe: -1088.148979 hartree
dipole: 3.7429 0.0662 -2.2560
dipole: 4.3707
quadrupole: -115.4239 -80.2914 -95.1293
quadrupole: 7.4073 -4.6933 3.6023
quadrupole: -18.4757 16.6568 1.8189 7.4073 -4.6933 3.6023
hfenergy: -1088.2741077 hartree
pointgroup: C01 [X(C11H8Cl1N1O2)]
dipole: 1.493348 0.2255646 0.8221831 debye
dipolederiv: -0.5088353 -0.154255 0.0937472 -0.3067299 -0.3162675 0.1218239 0.4172601 0.2254307 -0.39419 -0.9909508 0.1329815 -0.1762229 0.1861581 -0.4334405 0.1253821 -0.2128967 0.110388 -0.2997117 -0.5609655 -0.1305271 -0.0221514 -0.2258941 -0.7153328 0.1600696 -0.0446777 0.1200252 -0.2850378 1.8010091 0.1891562 0.2600282 0.3885649 0.9702769 -0.3067096 0.3233779 -0.2393149 0.3364527 0.0186016 -0.1375883 -0.0138458 -0.1105027 -0.1837179 -0.0006586 0.0061233 -0.0334578 0.0219572 0.0203152 0.0093878 -0.0077241 -0.4047909 -0.001132 -0.0043542 0.0240858 0.0299904 0.055077 -0.0954041 -0.0778374 -0.011742 -0.0715833 -0.0326897 0.0391873 -0.1159488 -0.0376053 -0.1175153 -0.5100987 -0.2076639 -0.062224 -0.471077 -0.0977529 0.0143192 -0.0688228 0.0072871 0.0155579 0.1981616 0.0380597 0.017122 -0.1307017 0.1105933 -0.0041369 -0.037825 0.0047623 -0.1060353 -0.1296439 0.0761624 0.0174534 0.1562636 -0.0315415 0.0241992 -0.000188 -0.0026886 -0.1280002 0.1051173 -0.1025005 0.0352043 -0.0147628 -0.0950825 -0.0041463 0.0472942 0.0178724 -0.1274346 -0.0432458 0.072947 0.0126946 0.0705125 0.2117062 0.0171572 -0.0212785 0.0144902 -0.1181056 0.1912442 -0.0129812 0.0242471 0.4202619 -0.0517321 0.0285901 -0.0242956 -0.0290223 -0.0896332 -0.452654 0.0683725 -0.0141301 0.0572884 0.180272 0.0080557 -0.0272221 -0.0085128 -0.1524034 0.6695034 0.2457268 -0.1591788 0.4323081 0.357197 -0.2095863 -0.3674036 -0.244449 0.5027482 0.006386 -0.0842067 -0.0258519 -0.0503813 0.0687401 -0.0020818 0.0040252 0.0015569 0.1381148 0.1039489 -0.0871379 -0.0091994 -0.0176462 0.1029302 -0.0133033 0.0142142 0.0035776 0.1607293 -0.0801945 0.0910423 -0.018681 0.0635468 0.0675077 -0.0063119 -0.0100258 0.0076065 0.1405136 0.0834999 0.0059739 -0.0027138 0.0048186 -0.1013947 -0.0127866 -0.0127595 -0.0121214 0.153624 0.0514212 0.0473985 -0.0026484 0.0213833 0.1128352 -0.0047942 0.0040876 0.0192181 0.1660052 0.0756608 0.0029901 -0.004255 -0.0007243 -0.0856337 -0.0085988 0.001575 -0.0030605 0.157516 -0.0166781 0.0133712 0.0012194 0.1067043 -0.001679 0.0941333 0.0258601 0.0628202 0.020923 0.0638017 0.0011279 0.0688523 -0.1030164 -0.034662 -0.055449 0.0754409 -0.0147932 -0.0511518 unknown
polarizability: 209.1207933|-2.0945086|174.3377691|2.8704808|-8.1717789|70.3264284 unknown
InChI: InChI=1S/C11H8ClNO2/c12-7-8-3-1-5-10-9(8)4-2-6-11(10)13(14)15/h1-6H,7H2
charge 0 multiplicity 1
23 atoms
Cl 4.006167 1.26317 -1.093498
O  -3.933759 0.453131 -0.583705
O  -3.118818 -1.501107 0.240544
N  -2.963127 -0.271325 -0.129791
C  0.837714 0.361792 0.211975
C  -0.398168 -0.39862 0.078784
C  2.101246 -0.339908 0.299962
C  -1.623477 0.365259 -0.010905
C  0.79125 1.793368 0.24044
C  -0.319938 -1.830758 0.000226
C  2.122372 -1.737421 0.212794
C  0.91596 -2.477161 0.056327
C  -1.636097 1.765552 0.014941
C  -0.419385 2.482806 0.144232
C  3.395263 0.388603 0.508584
H  1.724514 2.358655 0.310535
H  -1.237473 -2.411362 -0.090856
H  3.079651 -2.268265 0.265478
H  0.957216 -3.569058 -0.011519
H  -2.5938 2.285166 -0.069118
H  -0.437449 3.576519 0.162623
H  4.2151 -0.296437 0.762091
H  3.341034 1.204605 1.243155
