program: Gaussian 09
title: 000226043
version: EM64L-G09RevD.01
frameworkgroup: C1[X(C9H9Cl2NO2)]
method: RPBEPBE
basis: SDD
operation: Freq
keyword: #p
keyword: freq=noraman
keyword: PBEPBE/SDD
title: #p freq=noraman PBEPBE/SDD
converged: YES YES NO NO
title: Mulliken charges:
elementType: Cl Cl O O N C C C C C C C C C H H H H H H H H H
charge: -0.030889 -0.048908 -0.325585 -0.288736 -0.140435 0.516230 0.318632 -0.319550 -0.276183 -0.607620 -0.621306 -0.202114 -0.210995 -0.107105 0.318302 0.230218 0.277940 0.229717 0.226869 0.227569 0.292024 0.282202 0.259723
chargesum: 0.00000
title: Mulliken charges with hydrogens summed into heavy atoms:
elementType: Cl Cl O O N C C C C C C C C C
charge: -0.030889 -0.048908 -0.325585 -0.288736 -0.140435 0.516230 0.318632 -0.319550 0.042119 0.130256 0.125156 0.080088 0.048728 -0.107105
polarizability: 2.06190515e+02 1.36121480e+01 1.36229177e+02 1.04750758e-01 -5.64862068e-02 5.91921364e+01
1716.lowfreq: -6.0225 0.0023 0.0030 0.0031 6.9320 8.8600 19.4304 34.3407 91.0201
frequency: 19.2788 34.3004 90.9986 93.0629 110.0203 115.9920 134.2049 163.5602 170.4332 215.3680 243.6146 255.2136 333.9055 359.6380 368.0881 401.1046 436.7181 438.4798 480.4533 547.5792 608.2975 646.9160 670.9527 699.3293 707.8771 767.7503 828.9670 836.6834 858.9593 964.0917 983.5278 1029.7564 1061.9929 1077.8689 1099.3786 1124.4255 1142.5829 1150.9728 1216.7430 1243.5320 1250.2680 1355.8226 1370.2073 1385.1368 1425.6545 1440.1014 1456.2462 1471.9852 1478.7068 1490.2947 1498.1033 1567.6810 1591.2894 1673.7013 2973.1602 2978.0133 3045.9468 3051.9051 3128.9585 3153.3761 3172.0562 3182.7406 3204.0908
redmass: 5.0423 6.1612 1.1517 6.0906 3.4166 1.2386 4.0846 6.2369 17.3597 6.4508 8.6318 2.6415 7.9625 4.5389 7.8757 3.8559 3.3679 6.7105 5.1941 4.3242 6.1822 7.5011 11.0825 4.7416 8.9551 9.2906 1.3515 6.4919 1.3887 1.3110 3.7995 4.5528 1.3782 2.1568 1.2178 2.3806 1.3555 1.3688 4.5881 1.6152 3.1322 5.2169 3.2565 4.8520 1.1564 1.1765 2.7210 1.0472 1.0427 1.0438 1.1630 8.1653 7.8268 8.1988 1.0373 1.0372 1.1015 1.1020 1.0977 1.0960 1.0915 1.0936 1.0947
irintensity: 3.9131 0.6884 0.5681 2.7687 2.1685 0.0126 0.4982 0.1891 0.4296 0.5541 0.1590 5.2450 0.0910 30.5867 1.9678 0.6430 7.4335 1.3367 11.0325 6.1818 3.9428 12.9583 18.1681 0.4689 34.0711 63.0593 50.4738 6.0964 22.3799 3.6358 13.9308 147.7617 17.4525 111.5681 0.0105 545.1753 0.8339 0.0248 331.6372 4.4851 9.3830 36.1930 177.4228 8.6594 30.5077 11.3895 336.6175 17.1119 1.3030 39.0735 31.5508 23.1411 0.3248 326.2547 24.6994 128.7442 45.6790 24.1685 1.8500 0.2008 1.4923 0.9172 12.8967
temp: 298.150 k
press: 1.00000 atm
elementType: 17 17 8 8 7 6 6 6 6 6 6 6 6 6 1 1 1 1 1 1 1 1 1
symmnumber: 1
zpe: 431122.6 jmol-1
zpe.correction: 0.164206 hartree
zpe.thermalcorrener: 0.178805 hartree
zpe.thermalcorrenthalpy: 0.179749 hartree
zpe.thermalcorrgfe: 0.120238 hartree
zpe.sumelectzpe: -1472.642649 hartree
zpe.sumelectthermal: -1472.628050 hartree
zpe.sumelectthermalent: -1472.627106 hartree
zpe.sumelectthermalfe: -1472.686617 hartree
dipole: 3.7684 0.9170 0.0479
dipole: 3.8787
quadrupole: -80.8838 -96.9165 -97.2168
quadrupole: 3.4622 0.1008 -0.1297
quadrupole: 10.7886 -5.2441 -5.5445 3.4622 0.1008 -0.1297
hfenergy: -1472.8068551 hartree
pointgroup: C01 [X(C9H9Cl2N1O2)]
dipole: 1.5006594 -0.250145 -0.1186349 debye
dipolederiv: -0.2520256 0.2119367 0.1177589 0.2463929 -0.4493262 -0.2307825 0.1383328 -0.2318797 -0.1748718 -0.9195005 0.0570176 0.0047776 0.036002 -0.1136743 -0.0289114 -0.0072606 -0.0283185 -0.079419 -2.508841 -0.366383 -0.3045094 -0.6788415 -0.4339261 -0.1864761 -0.4923308 -0.1763154 -0.2947042 -0.8851191 0.0903279 0.0383143 0.0898004 -0.8782008 -0.3262245 0.0358302 -0.3256912 -0.5467154 -1.4817078 0.1572742 0.0580779 0.2355149 -0.509552 -0.1062441 0.1013702 -0.1041686 -0.3910249 1.7038641 0.2556515 0.2055558 -0.0927184 -0.1101568 -0.1431374 -0.0077789 -0.1308579 0.044279 2.8725244 -0.0695693 0.0462927 0.3861644 1.1554702 0.5532195 0.3252143 0.5358011 0.6276013 0.1051616 -0.3340981 -0.190981 -0.3982138 0.6202447 0.4069602 -0.2289167 0.4087544 0.1395341 -0.243064 -0.1000688 -0.0626822 0.1021153 -0.0597339 0.0496066 0.0581411 0.0445366 -0.1102328 0.4899037 0.1158566 0.0795643 0.3189461 0.1154765 -0.0774091 0.2055354 -0.0843451 0.2164351 0.0910827 -0.1455123 -0.0951827 -0.3096466 0.3416551 0.0351733 -0.1950659 0.0390677 0.2942836 -0.3426199 0.0903313 0.0437259 0.110652 -0.1547534 -0.052403 0.0550278 -0.0529703 -0.0889608 -0.2738781 0.0152414 0.0029293 -0.0464531 0.0035683 0.0654606 -0.0322935 0.0686729 -0.0716063 1.2532831 -0.0810256 -0.003325 -0.0620184 0.0706393 0.0855301 0.0080794 0.084566 -0.0272145 0.205467 -0.0141881 -0.0068217 -0.0098988 0.1078189 -0.0450062 -0.0029742 -0.0463193 0.1573903 -0.0841938 0.0162209 -0.0874743 0.0814449 0.0017058 0.1264717 -0.1375994 0.0740361 0.0084032 0.1562271 0.0748895 0.0457462 -0.0165279 0.0191065 -0.0702643 -0.0100108 -0.0675194 0.0930805 -0.0994294 -0.0683263 0.0548138 -0.0800024 0.0945948 0.0229964 0.1370372 0.0733132 -0.0684491 -0.0101373 0.1355173 -0.0470672 0.1425621 -0.0344212 0.0235617 -0.0893559 0.0996637 -0.021293 -0.0179513 0.0217626 0.1440619 -0.0146393 0.0246491 0.0650494 0.1699821 -0.0116981 -0.0748334 0.1123108 -0.0810688 -0.0471083 -0.0630929 0.0691062 -0.0389195 -0.0369367 -0.03952 0.104975 0.0764858 -0.0314788 -0.0217527 -0.0316076 0.0759881 -0.0577042 -0.0217335 -0.0578454 0.1375024 0.0521575 0.0496916 0.0252859 0.0540658 0.0437212 -0.0705475 0.0277063 -0.0709627 0.1258406 unknown
polarizability: 207.385766|-10.41591|115.3824064|-1.1451779|33.0858939|78.8436563 unknown
InChI: InChI=1S/C9H9Cl2NO2/c1-12(2)9(13)14-8-4-3-6(10)5-7(8)11/h3-5H,1-2H3
charge 0 multiplicity 1
23 atoms
Cl -0.319775 -2.353065 -1.606179
Cl -4.991821 0.292545 -0.203492
O  1.028806 -0.132157 -0.259628
O  1.728004 1.792884 0.953722
N  3.260536 0.254546 0.060014
C  -0.36134 0.066328 -0.184153
C  2.001786 0.743778 0.31633
C  -1.140266 -0.944751 -0.804913
C  -1.020837 1.156522 0.435787
C  4.418881 1.011742 0.564249
C  3.549814 -0.98037 -0.690323
C  -2.545021 -0.889683 -0.818634
C  -2.431258 1.224668 0.429762
C  -3.172664 0.205889 -0.194387
H  -0.425879 1.93469 0.914982
H  5.011377 0.388245 1.260251
H  4.062044 1.906632 1.094437
H  5.069666 1.320726 -0.275566
H  4.127801 -1.67933 -0.055998
H  4.151848 -0.744788 -1.588926
H  2.615526 -1.464445 -1.000441
H  -3.125718 -1.678866 -1.302048
H  -2.93821 2.066461 0.908954
