program: Gaussian 09
title: 000226041
version: EM64L-G09RevD.01
frameworkgroup: C1[X(C8H13NO6)]
method: RPBEPBE
basis: SDD
operation: Freq
keyword: #p
keyword: freq=noraman
keyword: PBEPBE/SDD
title: #p freq=noraman PBEPBE/SDD
converged: YES YES NO NO
title: Mulliken charges:
elementType: O O O O O O N C C C C C C C C H H H H H H H H H H H H H
charge: -0.189179 -0.208484 -0.415444 -0.410722 -0.217607 -0.229258 0.080625 0.336721 -0.480190 -0.432953 -0.732774 -0.510223 -0.508534 0.177726 0.174200 0.273127 0.246122 0.260684 0.231232 0.210763 0.235768 0.254845 0.264126 0.268009 0.297712 0.257970 0.383547 0.382193
chargesum: 0.00000
title: Mulliken charges with hydrogens summed into heavy atoms:
elementType: O O O O O O N C C C C C C C C
charge: -0.189179 -0.208484 -0.031897 -0.028529 -0.217607 -0.229258 0.080625 0.336721 0.039058 0.058963 -0.031397 0.021912 0.047147 0.177726 0.174200
polarizability: 1.12418453e+02 3.51412815e+00 1.15093266e+02 4.52160708e+00 4.22184812e+00 1.07569896e+02
1716.lowfreq: -18.3203 -12.5957 -0.0011 -0.0009 -0.0008 9.6509 11.3778 16.0784 23.0929
frequency: 7.1557 11.7661 21.7098 34.4185 53.5786 82.6904 98.8077 117.6105 129.4154 186.4347 209.7135 230.4603 251.7579 276.0089 308.0132 349.3685 390.9832 445.7578 462.2806 501.5770 503.5041 526.5061 560.3510 582.5679 612.5327 638.2202 639.2369 683.1162 759.4757 764.0266 789.3859 815.9205 868.6246 885.9991 937.5449 976.0956 1023.2997 1038.1307 1047.4808 1073.8883 1087.8598 1099.2414 1133.3886 1166.0285 1208.2154 1219.4555 1229.3301 1245.3208 1250.7592 1289.8494 1297.3540 1310.7391 1324.9023 1373.7018 1379.0444 1390.0143 1408.0360 1439.4804 1445.1215 1462.1294 1468.6814 1472.5746 1483.1236 1664.4381 1671.7289 2998.0838 3001.8829 3003.8764 3011.1019 3022.1360 3047.1482 3049.3715 3071.4720 3090.4880 3095.8899 3118.2318 3514.6877 3515.2342
redmass: 9.7057 11.8441 9.8524 8.0690 3.1055 2.6887 4.9679 4.0033 2.8307 3.6532 1.3245 3.7727 4.0341 2.8950 4.2421 4.4451 3.4523 4.5076 4.1004 1.8257 1.8683 3.9365 3.9813 4.7574 3.0139 1.3471 1.3314 6.2187 2.3860 2.8918 1.6750 2.8772 4.1749 3.6842 2.0677 1.5804 1.8631 2.9074 2.6388 2.0759 2.3716 2.2448 1.6603 1.5224 3.2498 2.2577 1.9285 1.4864 1.6869 1.1869 1.2227 1.6501 1.8552 1.9524 1.7947 1.9240 2.1697 1.0873 1.0900 1.0648 1.0708 1.0794 1.0682 8.1729 8.3378 1.0591 1.0508 1.0498 1.0594 1.0632 1.0983 1.0974 1.1011 1.1004 1.0996 1.0992 1.0640 1.0641
irintensity: 1.8142 1.2450 0.1326 0.0496 0.8608 0.8223 0.3531 2.2710 2.3957 1.0034 1.1338 0.1847 2.9958 2.8418 3.2003 1.7235 3.6490 29.7323 31.5379 22.2410 25.6393 32.0918 23.2625 11.6943 5.6270 140.0057 115.0221 1.0439 41.1879 7.0326 19.9872 6.4788 1.4089 1.3139 9.2848 16.6324 16.3378 192.9132 200.5912 44.7514 75.7122 13.3513 1.5268 7.3091 53.7965 18.0231 10.2103 5.7211 1.6012 5.6401 4.0601 81.3388 103.7277 59.9800 25.7539 110.1035 24.6835 41.9018 11.2099 1.0351 23.4366 4.3728 29.2965 205.6343 210.3130 4.4250 6.7221 11.7183 13.9305 4.8015 1.9066 4.4141 16.5706 12.5362 21.0087 13.5374 27.1657 27.9912
temp: 298.150 k
press: 1.00000 atm
elementType: 8 8 8 8 8 8 7 6 6 6 6 6 6 6 6 1 1 1 1 1 1 1 1 1 1 1 1 1
symmnumber: 1
zpe: 561978.9 jmol-1
zpe.correction: 0.214046 hartree
zpe.thermalcorrener: 0.230892 hartree
zpe.thermalcorrenthalpy: 0.231836 hartree
zpe.thermalcorrgfe: 0.163921 hartree
zpe.sumelectzpe: -817.506361 hartree
zpe.sumelectthermal: -817.489516 hartree
zpe.sumelectthermalent: -817.488572 hartree
zpe.sumelectthermalfe: -817.556487 hartree
dipole: -1.8882 -3.0536 2.4970
dipole: 4.3731
quadrupole: -86.4593 -90.5011 -98.0804
quadrupole: -3.5206 -8.7688 8.4534
quadrupole: 5.2210 1.1791 -6.4001 -3.5206 -8.7688 8.4534
hfenergy: -817.7204079 hartree
pointgroup: C01 [X(C8H13N1O6)]
dipole: -0.6759412 1.2354754 -0.988375 debye
polarizability: 112.1852742|-3.4161742|115.4075736|-4.2753078|4.3994982|107.4887672 unknown
InChI: InChI=1S/C8H13NO6/c1-8(9(14)15,4-2-6(10)11)5-3-7(12)13/h10,12H,2-5H2,1H3
charge 0 multiplicity 1
28 atoms
O  1.09292 -3.29506 0.122515
O  0.652146 -1.844432 1.812357
O  -3.65443 2.224596 -0.62233
O  3.074227 2.515359 1.005032
O  -3.664278 0.735033 1.161202
O  3.361963 1.601153 -1.11008
N  0.608217 -2.195659 0.573157
C  -0.019299 -1.17171 -0.457588
C  -1.248829 -0.539977 0.245236
C  1.126654 -0.162376 -0.781057
C  -0.399572 -1.96275 -1.721842
C  -1.91518 0.569639 -0.591553
C  1.573718 0.745937 0.380032
C  -3.140375 1.138955 0.10209
C  2.741548 1.625343 -0.024282
H  -0.952044 -0.139574 1.228179
H  -1.991297 -1.332225 0.452801
H  1.99687 -0.725638 -1.164968
H  0.782601 0.462382 -1.626563
H  -0.808589 -1.270632 -2.478379
H  -1.161982 -2.728898 -1.499909
H  0.476813 -2.468785 -2.155397
H  -1.226531 1.410393 -0.797104
H  -2.244233 0.199904 -1.581462
H  1.877669 0.156312 1.265582
H  0.760688 1.40616 0.73499
H  -4.462703 2.57806 -0.160368
H  3.85371 3.06819 0.724709
