program: Gaussian 09
title: 000226031
version: EM64L-G09RevD.01
frameworkgroup: C1[X(C11H13NO)]
method: RPBEPBE
basis: SDD
operation: Freq
keyword: #p
keyword: freq=noraman
keyword: PBEPBE/SDD
title: #p freq=noraman PBEPBE/SDD
converged: YES YES NO NO
title: Mulliken charges:
elementType: O N C C C C C C C C C C C H H H H H H H H H H H H H
charge: -0.430404 -0.113645 -0.557473 -0.419599 0.386113 -0.478152 0.133922 0.040461 -0.421137 -0.502856 0.464322 -0.437643 -0.812719 0.223733 0.220277 0.216676 0.208892 0.233632 0.260631 0.271596 0.231561 0.230728 0.231619 0.220860 0.231650 0.366954
chargesum: 0.00000
title: Mulliken charges with hydrogens summed into heavy atoms:
elementType: O N C C C C C C C C C C C
charge: -0.063450 -0.113645 -0.113462 0.005970 0.386113 0.016111 0.133922 0.040461 -0.189576 -0.231260 0.464322 -0.206915 -0.128589
polarizability: 1.76699379e+02 1.02709812e+01 1.51496715e+02 1.47464009e+00 -2.62971883e+00 6.89278658e+01
1716.lowfreq: -33.9114 -13.9078 0.0004 0.0005 0.0006 6.4435 10.5273 41.1690 113.5004
frequency: -33.8918 40.9444 113.4987 124.2097 171.2126 237.3332 262.8631 283.5798 338.4945 349.5740 398.8901 408.7724 437.7066 449.3184 468.0859 520.6065 541.4222 615.2281 642.4113 707.4853 717.7504 753.1878 815.4916 835.5707 863.0658 894.7124 911.4761 923.0040 932.8232 963.7458 1001.9929 1042.4955 1050.8007 1063.3913 1088.0084 1140.7709 1147.9811 1181.0835 1202.2008 1212.8622 1241.4147 1244.1940 1274.9210 1319.8130 1327.8501 1348.1350 1359.2177 1378.0080 1398.2861 1417.0589 1447.7704 1460.0728 1470.7795 1473.4491 1477.6813 1493.3233 1562.3445 1578.7218 1624.9741 2954.0360 2970.0636 2977.0975 2991.9879 3033.5961 3049.7548 3056.1598 3056.8680 3082.3867 3112.5774 3137.1679 3144.4250 3569.2941
redmass: 1.0278 2.9852 3.6034 3.1810 4.5083 2.3462 5.4979 3.6387 2.4432 4.7876 1.8421 4.1109 2.1781 2.9500 2.9451 2.8049 2.5672 3.5963 5.0925 3.6516 4.5353 3.2554 1.4189 3.3629 1.6825 2.5448 3.4430 1.3759 2.7629 1.3716 1.4529 2.5667 1.5621 1.9535 2.0109 1.2401 1.3312 1.7568 2.1480 1.7545 1.3012 1.6229 1.3441 1.9953 1.4415 1.4933 1.7190 5.9927 1.2581 3.2595 1.1540 1.1111 1.0458 1.0981 1.1396 2.7398 6.3162 6.2292 7.0488 1.0665 1.0677 1.0370 1.0612 1.0930 1.0945 1.0977 1.1006 1.0988 1.0870 1.0960 1.0922 1.0673
irintensity: 0.4425 0.1576 0.4037 3.3023 0.9558 0.2899 1.8971 0.8323 1.7679 3.7375 58.3969 1.0164 41.9155 1.1879 19.8208 46.3776 1.7450 5.1892 18.6328 1.6238 1.3608 2.1132 33.7789 74.7882 48.6488 8.8945 34.1497 4.9181 34.4672 1.8624 2.4778 1.7024 13.1946 1.5002 9.0873 2.5634 2.1089 2.0686 31.0975 4.0456 2.7514 68.6559 18.4847 4.2200 2.0843 4.0201 2.7943 1.3755 7.7731 10.5196 6.3805 13.2332 12.9763 7.8738 14.5862 28.7904 12.2816 0.6355 0.8497 30.6254 10.3670 39.1268 37.8478 40.1594 33.9443 18.7148 34.9994 20.2880 12.5890 30.4917 5.1550 63.1574
temp: 298.150 k
press: 1.00000 atm
elementType: 8 7 6 6 6 6 6 6 6 6 6 6 6 1 1 1 1 1 1 1 1 1 1 1 1 1
symmnumber: 1
zpe: 561571.8 jmol-1
zpe.correction: 0.213891 hartree
zpe.thermalcorrener: 0.224977 hartree
zpe.thermalcorrenthalpy: 0.225922 hartree
zpe.thermalcorrgfe: 0.176897 hartree
zpe.sumelectzpe: -555.960930 hartree
zpe.sumelectthermal: -555.949844 hartree
zpe.sumelectthermalent: -555.948900 hartree
zpe.sumelectthermalfe: -555.997925 hartree
dipole: 0.1920 0.6293 0.0577
dipole: 0.6605
quadrupole: -70.4782 -66.6628 -79.7526
quadrupole: -0.0949 0.2492 -0.7203
quadrupole: 1.8197 5.6350 -7.4547 -0.0949 0.2492 -0.7203
hfenergy: -556.1748218 hartree
pointgroup: C01 [X(C11H13N1O1)]
dipole: -0.0832132 -0.2439398 0.0330336 debye
dipolederiv: -1.3245623 -0.8980094 0.0820187 -0.3101086 -0.2482383 0.0070127 0.0419005 0.0250953 -0.3826594 0.6271922 0.7362734 -0.0777135 0.1412414 -0.150279 -0.009549 -0.0175237 -0.0161508 -0.1946898 -0.0037343 0.027925 -0.0264996 0.0365654 0.0944097 -0.0150908 -0.0051128 -0.0741275 0.1408828 0.1164068 -0.0232922 -0.018913 -0.0263922 0.0497024 0.015461 0.0279794 -0.0095898 0.1342361 0.0363017 -0.2296927 -0.0299697 -0.1363955 0.0628503 0.0068478 -0.0913001 0.0678487 -0.0628267 -0.1069644 0.0589686 -0.0018546 0.0453379 -0.0428557 0.0067516 -0.0263655 -0.0387832 0.1807644 -0.0424702 0.0876644 -0.0057812 0.1960739 -0.0236806 -0.0045611 -0.011871 -0.0331323 -0.004381 0.5046883 -0.0457097 -0.0087831 -0.1438439 0.1422543 0.0159246 -0.005879 0.0426851 -0.0031542 -0.079236 0.1631454 -0.0002729 0.106506 0.0929403 0.0163071 0.0196916 0.0151164 -0.1551665 -0.1704182 0.1423819 0.0063003 0.0020405 -0.002567 0.015894 0.0123586 0.0004547 -0.1498705 0.1645897 -0.2465617 -0.0196228 -0.3242344 0.1212377 0.0228858 -0.0266574 0.0180338 -0.0296651 -0.0359275 0.0110016 -0.0104439 0.1646474 -0.0492796 -0.004065 0.0046812 -0.0024884 -0.170214 0.0151388 0.0814894 0.0061186 0.1528082 -0.0688689 -0.0118141 0.0123674 -0.0136621 0.0630909 -0.0007584 -0.0984204 0.0287581 -0.0411787 -0.1305704 0.0582156 0.0034205 0.1017325 0.0587046 -0.0055178 0.0941632 0.051065 0.0443729 0.0386266 -0.0263938 0.0443907 -0.076628 -0.1333713 0.0675087 -0.0395839 0.0589585 -0.0389595 0.0583735 -0.0415341 0.0060146 0.0080916 -0.160234 -0.1200702 0.1560433 -0.0101163 0.1407303 -0.0852303 0.0071131 0.0196574 -0.0126254 0.0824176 0.0828341 0.0324193 0.0326559 0.0429348 0.0175571 -0.0144787 0.0807568 -0.001173 -0.1014058 -0.0321572 -0.0250575 -0.0629213 -0.0746343 0.0413102 -0.0326344 -0.0811314 0.0033392 0.0545856 0.1208763 -0.0284646 -0.0041262 0.0001206 -0.0436372 -0.009751 -0.0059071 -0.0053021 0.140104 0.0720163 -0.017728 0.0014439 -0.0559265 -0.1358211 -0.0073735 -0.0020251 -0.0011216 0.1437084 -0.1406422 -0.0540121 0.0090632 -0.0390551 0.0773683 0.0000471 0.0097235 0.0008367 0.1515639 0.0438203 0.0151081 0.0377237 0.0618597 -0.0210465 0.1063524 -0.0294232 0.1327502 -0.0296952 -0.1327575 -0.0266153 0.004434 -0.144386 0.0328476 -0.0000169 -0.0010563 -0.0027336 0.1066416 0.0425833 0.0150001 -0.0392008 0.0538548 0.0039824 -0.106011 0.0311206 -0.1299312 -0.0582703 0.3012597 0.1115636 -0.0023208 0.146021 0.1686142 0.0044604 -0.0098102 0.0014646 0.378904 unknown
polarizability: 177.2146228|9.3174047|150.9029012|-4.5684238|-0.2971261|69.0064357 unknown
InChI: InChI=1S/C11H13NO/c1-8-5-6-9-3-2-4-11(12-13)10(9)7-8/h5-7,13H,2-4H2,1H3
charge 0 multiplicity 1
26 atoms
O  3.102529 2.112224 -0.276959
N  1.656329 1.842778 -0.21303
C  0.78305 -2.325042 -0.199644
C  2.069095 -1.844453 0.504823
C  -0.31634 -1.276497 -0.106525
C  2.538178 -0.500854 -0.088964
C  0.006638 0.114791 -0.061281
C  1.431308 0.54102 -0.118832
C  -1.678149 -1.654631 -0.063222
C  -1.039418 1.074466 0.023162
C  -2.398412 0.693777 0.060119
C  -2.706347 -0.691758 0.014963
C  -3.496994 1.73995 0.151318
H  0.43021 -3.279233 0.233923
H  1.015307 -2.531736 -1.266403
H  1.871893 -1.724874 1.587758
H  2.873302 -2.596231 0.397509
H  2.896855 -0.652734 -1.128815
H  3.399938 -0.088224 0.464936
H  -0.766731 2.134775 0.057434
H  -1.934509 -2.72104 -0.088968
H  -3.754058 -1.014301 0.048786
H  -3.452972 2.444989 -0.699821
H  -4.498212 1.275244 0.15228
H  -3.404012 2.341334 1.075173
H  3.120618 3.102261 -0.322319
