program: Gaussian 09
title: 000225971
version: EM64L-G09RevD.01
frameworkgroup: C1[X(C4H4Cl6O3S)]
method: RPBEPBE
basis: SDD
operation: Freq
keyword: #p
keyword: freq=noraman
keyword: PBEPBE/SDD
title: #p freq=noraman PBEPBE/SDD
converged: YES YES NO NO
title: Mulliken charges:
elementType: Cl Cl Cl Cl Cl Cl S O O O C C C C H H H H
charge: 0.101087 0.103118 0.127239 0.101083 0.127237 0.103138 0.986436 -0.369758 -0.369763 -0.526276 -0.221398 -0.221363 -0.542242 -0.542251 0.283650 0.288214 0.288200 0.283649
chargesum: 0.00000
title: Mulliken charges with hydrogens summed into heavy atoms:
elementType: Cl Cl Cl Cl Cl Cl S O O O C C C C
charge: 0.101087 0.103118 0.127239 0.101083 0.127237 0.103138 0.986436 -0.369758 -0.369763 -0.526276 0.350466 0.350486 -0.542242 -0.542251
polarizability: 1.79483168e+02 -7.97607754e-03 1.27223924e+02 2.14942966e-03 1.31864059e+00 1.20948867e+02
1716.lowfreq: -10.5902 -5.5433 -3.7266 -0.0017 0.0011 0.0012 1.1808 13.6061 28.0390
frequency: -10.2453 13.3554 28.0389 42.3636 61.2421 62.3295 78.2255 157.0879 157.3776 174.0045 179.0949 229.9764 236.8787 240.9335 254.1627 290.8927 304.7568 321.6957 334.9564 350.1504 361.0820 410.3642 463.9279 485.7367 495.6087 521.6187 531.2916 644.3946 646.1452 731.1876 734.7625 914.5327 937.8574 958.0129 1024.0125 1025.2958 1053.9660 1056.1968 1251.6906 1254.2617 1348.2169 1356.4803 1419.5847 1423.7564 2954.4807 2956.7909 3067.6354 3067.8004
redmass: 18.4738 18.2846 18.7446 17.8032 11.0715 14.6167 21.5337 17.9496 20.9898 18.3423 17.5624 18.8954 12.6102 12.8056 22.0702 17.6544 14.6257 4.5445 3.3523 19.9542 23.5215 4.0194 5.3490 7.4832 10.2328 7.9662 6.7202 5.7971 5.8722 11.0791 11.0153 17.4490 9.9522 10.2301 2.0081 2.0295 6.0830 6.0163 1.0724 1.0694 1.1934 1.1899 1.0662 1.0671 1.0641 1.0638 1.0974 1.0973
irintensity: 0.2138 0.1802 0.4021 1.3931 0.0883 0.0603 0.0504 0.3984 1.4306 0.2188 0.2152 3.6673 0.5916 8.7881 2.0059 41.6770 1.8277 5.7962 9.3439 26.0507 15.8409 38.7093 5.9229 42.8887 13.4173 115.8992 58.6019 33.3176 205.9195 102.4762 255.3183 40.7704 217.6572 13.4661 2.8850 71.4863 6.4458 32.1774 0.7329 21.6115 22.3293 18.0110 0.1131 25.4259 14.0699 3.6275 0.6898 0.0979
temp: 298.150 k
press: 1.00000 atm
elementType: 17 17 17 17 17 17 16 8 8 8 6 6 6 6 1 1 1 1
symmnumber: 1
zpe: 219001.6 jmol-1
zpe.correction: 0.083413 hartree
zpe.thermalcorrener: 0.100302 hartree
zpe.thermalcorrenthalpy: 0.101246 hartree
zpe.thermalcorrgfe: 0.034399 hartree
zpe.sumelectzpe: -3537.679170 hartree
zpe.sumelectthermal: -3537.662281 hartree
zpe.sumelectthermalent: -3537.661337 hartree
zpe.sumelectthermalfe: -3537.728184 hartree
dipole: -0.0004 0.6813 -1.3202
dipole: 1.4856
quadrupole: -144.6551 -133.9604 -124.8445
quadrupole: -0.0011 -0.0005 -4.7127
quadrupole: -10.1684 0.5263 9.6421 -0.0011 -0.0005 -4.7127
hfenergy: -3537.7625832 hartree
pointgroup: C01 [X(C4H4Cl6O3S1)]
dipole: -0.0001466 -0.1346731 0.5687534 debye
dipolederiv: -0.4282212 -0.1952237 0.1959195 -0.2750427 -0.4414689 0.2775374 0.2003439 0.2608894 -0.3747609 -0.2269753 0.0114436 0.0479626 0.0148856 -0.2009591 -0.1764583 0.0177174 -0.1900273 -0.6745505 -0.3325224 0.2726009 0.0227497 0.2621541 -0.6124964 -0.030783 -0.0089454 -0.0347361 -0.1354915 -0.4281379 0.1950992 -0.1959687 0.2749221 -0.4412776 0.2776013 -0.2004204 0.2609461 -0.3750289 -0.3325624 -0.2726453 -0.0226493 -0.2621318 -0.6124816 -0.0306068 0.0090321 -0.0345709 -0.1354721 -0.2268857 -0.011452 -0.047911 -0.0148767 -0.2010934 -0.1766494 -0.0176595 -0.1902151 -0.6744005 2.0037792 0.0000559 0.0000256 0.0001307 0.6958555 0.2768736 -0.0001383 0.0466734 0.6874273 -1.1907767 -0.0122531 0.1182791 -0.2187751 -0.289729 0.1016141 0.6211002 -0.0041008 -0.3719162 -1.1909012 0.0122101 -0.1183626 0.2186707 -0.2897046 0.1016366 -0.6212146 -0.0041391 -0.371968 -0.4896877 0.000007 -0.0000193 0.0000109 -0.4735811 -0.3155762 0.0000343 0.0679859 -0.2726896 0.5761343 0.1299791 -0.057997 0.6205381 -0.0461817 -0.1188403 -0.2063739 0.0108588 0.0410794 0.576019 -0.1299978 0.0580612 -0.6205802 -0.0461737 -0.1188462 0.2067937 0.0109055 0.0412068 0.8814519 -0.1351206 -0.2702889 -0.0794554 1.3446217 -0.0467352 -0.168599 -0.0605649 1.2176912 0.8814674 0.1352923 0.2701579 0.0795202 1.3445487 -0.0467983 0.1684556 -0.0606186 1.2177922 -0.0629236 -0.0339646 0.014242 -0.0865132 0.1080709 -0.0213465 0.0474308 -0.0248931 -0.0198695 0.0268165 0.0752434 0.0071036 -0.0632481 0.0270094 0.0343677 -0.0369711 -0.0147443 0.1104253 0.0268354 -0.0752494 -0.0070661 0.0632656 0.0270072 0.0344021 0.0369027 -0.0147171 0.1103941 -0.0629096 0.0339749 -0.0142383 0.0865253 0.1080337 -0.0213926 -0.0474886 -0.0249317 -0.0198686 unknown
polarizability: 179.4831677|0.0070697|127.4759942|-0.0033449|-0.3058131|120.6967975 unknown
InChI: InChI=1S/C4H4Cl6O3S/c5-3(6,7)1-12-14(11)13-2-4(8,9)10/h1-2H2
charge 0 multiplicity 1
18 atoms
Cl -4.490076 -1.577259 0.865796
Cl -3.527042 -0.940652 -1.948774
Cl -4.488021 1.285199 -0.13093
Cl 4.489855 -1.576913 0.866473
Cl 4.488146 1.285136 -0.131429
Cl 3.527137 -0.941375 -1.948443
S  -0.00007 0.105677 -1.412335
O  -1.406236 0.812883 -0.349423
O  1.406375 0.81304 -0.349984
O  0.000016 -1.480314 -1.122849
C  -2.162959 -0.189213 0.385272
C  2.162917 -0.188859 0.385179
C  -3.583826 -0.330305 -0.192178
C  3.583812 -0.330316 -0.192105
H  -2.23377 0.153265 1.433112
H  -1.666209 -1.183696 0.348599
H  1.66607 -1.183304 0.348823
H  2.233682 0.154007 1.432895
