program: Gaussian 09
title: 000226023
version: EM64L-G09RevD.01
frameworkgroup: C1[X(C21H34O3)]
method: RPBEPBE
basis: SDD
operation: Freq
keyword: #pfreq=noraman
keyword: PBEPBE/SDD
title: #p freq=noraman PBEPBE/SDD
converged: YES YES NO NO
title: Mulliken charges:
elementType: O O O C C C C C C C C C C C C C C C C C C C C C H H H H H H H H H H H H H H H H H H H H H H H H H H H H H H H H H H
charge: -0.453661 -0.446530 -0.215222 -0.073519 -0.168721 -0.158050 0.394987 0.393889 -0.095043 -0.538373 -0.531559 -0.518355 -0.239719 -0.535449 -0.180300 -0.527255 -0.474841 -0.518292 -0.851132 -0.830910 -0.457048 -0.061866 0.160412 -0.802497 0.176752 0.250920 0.203270 0.208139 0.239206 0.208400 0.196745 0.203314 0.197856 0.222451 0.232704 0.205885 0.234342 0.206115 0.199316 0.209253 0.261059 0.209328 0.266022 0.210737 0.215051 0.226701 0.233585 0.253408 0.222345 0.226595 0.222602 0.182426 0.200571 0.334709 0.241326 0.248396 0.254158 0.325367
chargesum: 0.00000
title: Mulliken charges with hydrogens summed into heavy atoms:
elementType: O O O C C C C C C C C C C C C C C C C C C C C C
charge: -0.118951 -0.121164 -0.215222 0.103233 0.082199 0.045220 0.394987 0.393889 0.113097 -0.090767 -0.131500 -0.098047 -0.007016 -0.095222 0.025814 -0.118685 -0.004454 -0.041534 -0.175795 -0.128562 -0.052020 0.138706 0.160412 -0.058617
polarizability: 2.80736718e+02 7.60919872e-01 2.12552883e+02 -1.03460793e+00 2.78756287e+00 1.82047705e+02
1716.lowfreq: -2.5035 -0.0006 -0.0002 0.0005 9.1460 16.2934 39.5456 48.1379 72.0434
frequency: 39.5299 48.1150 72.0274 79.6271 81.7444 96.4189 108.0981 116.7838 145.6036 166.9068 191.7708 194.5499 215.8739 223.6514 244.5813 252.5140 264.0859 275.2718 281.1931 282.3388 296.4186 301.2993 309.6224 321.3556 333.3914 339.5578 359.1612 381.4388 396.8964 405.4620 426.7386 447.1890 456.2947 459.5816 476.4109 506.4004 526.2786 548.6100 560.9162 580.2857 595.2398 626.5799 643.9299 688.6805 706.9633 741.2576 796.2769 798.4433 824.3184 829.2210 834.8034 868.8105 875.0521 905.1672 907.1418 920.5040 937.1431 939.0089 952.7342 963.7188 975.1867 978.5483 986.7120 994.0902 1005.7225 1008.2529 1013.5036 1026.8094 1037.2805 1042.3237 1045.8516 1053.2013 1060.4733 1078.2544 1086.6285 1101.4161 1109.1009 1114.2134 1130.0134 1131.9896 1147.6890 1151.2907 1166.8713 1171.7900 1182.2877 1192.6558 1193.9792 1207.2715 1213.9576 1224.7568 1229.3922 1244.3204 1247.9635 1258.5108 1261.7426 1271.9461 1278.7865 1287.0840 1292.2832 1294.9147 1298.7459 1303.8933 1319.6320 1323.4486 1329.5828 1331.7179 1334.8316 1335.9149 1340.2039 1351.4656 1353.6630 1356.4254 1360.5049 1365.2966 1371.8511 1387.5717 1400.1766 1402.4206 1408.8180 1443.0789 1451.6936 1456.5311 1460.2938 1463.9526 1465.8602 1468.2856 1472.9872 1473.8374 1478.2601 1490.0782 1491.1073 1493.7308 1500.7207 1621.5014 2900.1006 2915.4543 2925.4056 2933.8222 2951.3324 2953.4897 2959.1490 2962.6539 2970.9221 2971.3099 2973.7450 2978.1105 2978.9469 2987.9575 2992.6927 2995.0278 3009.1545 3011.9246 3013.2734 3017.2432 3033.8008 3038.9091 3050.5021 3052.8763 3063.1808 3066.3014 3076.2141 3079.0995 3079.4770 3084.9675 3098.7409 3119.1751 3547.9183 3558.4751
redmass: 4.6538 3.9739 3.2713 4.1168 5.6164 2.7194 1.6637 1.8733 1.9036 4.1375 2.5435 2.5703 1.7898 2.1505 2.7181 2.2946 2.7928 1.3481 1.6973 1.5292 1.4556 2.5944 1.9598 1.9869 3.3366 2.7487 3.0484 3.8167 3.1978 2.9825 2.6353 3.5568 2.4475 2.3217 3.1239 2.5857 3.1039 3.1766 3.0878 3.5992 3.4276 3.5224 2.4336 2.7097 2.2159 3.0742 1.9753 2.1666 2.2741 2.0903 1.8591 1.7141 1.8857 2.2543 2.2676 3.1098 1.8841 2.0686 2.1600 1.9970 2.1118 1.9945 1.8905 2.0643 2.6661 2.2383 2.8282 1.9115 2.0142 2.0203 2.1325 2.4009 2.1481 2.1831 2.9196 1.5845 1.6627 2.2311 2.0756 1.8196 2.0452 1.7504 1.7834 1.6711 2.0982 1.7582 1.6719 1.4091 1.3391 1.4703 1.5211 1.4917 1.3739 1.5244 1.4502 1.4895 1.3555 1.2881 1.4112 1.3131 1.3779 1.3299 1.3609 1.3724 1.2965 1.4029 1.4002 1.4938 1.4586 1.3106 1.2876 1.3400 1.4790 1.2477 1.4335 1.2375 1.5146 1.2306 1.5179 1.0736 1.0599 1.0817 1.0768 1.0806 1.0910 1.0792 1.0713 1.0710 1.0748 1.0778 1.0556 1.0844 1.0618 7.2646 1.0810 1.0808 1.0831 1.0820 1.0605 1.0635 1.0723 1.0758 1.0650 1.0787 1.0765 1.0386 1.0446 1.0631 1.0435 1.0571 1.0660 1.0678 1.0947 1.0955 1.0992 1.0989 1.1003 1.0974 1.0938 1.0975 1.1010 1.0977 1.0981 1.0966 1.0984 1.1006 1.0659 1.0661
irintensity: 0.8397 1.2554 2.2572 1.8474 1.7152 1.0866 2.0245 0.2966 0.8467 0.1466 0.2676 0.6810 1.6043 3.4569 0.6341 1.0488 6.5634 4.4158 40.8983 55.3748 92.0591 2.5819 17.1249 57.1027 1.4581 16.9484 3.4280 3.2925 4.0995 3.6299 0.8701 2.7877 5.9396 0.7666 0.8563 1.6793 1.3063 7.2641 2.3903 8.6616 6.3890 0.3129 0.8418 11.1038 3.4403 5.6523 2.4899 0.2402 9.0591 2.1856 0.9921 6.1900 2.2196 4.3724 2.2264 4.7435 14.9885 11.4963 18.7445 12.3458 34.8340 5.6631 9.4363 39.3554 29.9735 14.1291 43.4825 5.4670 3.5022 11.3746 13.6942 13.4134 6.8014 2.5881 6.7430 5.3206 20.9950 9.0175 0.5826 9.5285 10.5669 4.4014 19.4769 21.0544 3.0129 41.5944 8.5443 25.4122 8.4142 22.5017 37.8780 0.9559 16.1500 2.1312 0.4992 5.2672 4.8042 4.0510 8.1407 0.2709 10.2007 2.5739 0.7302 1.8851 11.1764 0.5485 2.5496 13.3328 15.6560 8.3075 0.0380 11.9462 17.6630 69.6755 8.1429 16.0735 5.6126 26.1259 2.6341 16.0758 9.9925 7.3536 6.4619 7.0536 5.0259 3.5597 11.4081 7.6309 4.5633 25.2146 4.7787 10.7962 7.0961 110.4733 12.4988 15.9923 32.3277 24.3296 40.2273 39.6801 59.7946 13.4694 41.6861 29.8586 45.8821 16.9606 17.8410 26.1752 20.7179 31.8477 32.1820 43.6483 19.4161 52.5962 27.2534 63.1004 20.9139 51.8717 9.2705 40.0844 26.7019 68.2708 12.1913 7.5006 23.3658 16.8197 2.0194 4.8931
temp: 298.150 k
press: 1.00000 atm
elementType: 8 8 8 6 6 6 6 6 6 6 6 6 6 6 6 6 6 6 6 6 6 6 6 6 1 1 1 1 1 1 1 1 1 1 1 1 1 1 1 1 1 1 1 1 1 1 1 1 1 1 1 1 1 1 1 1 1 1
symmnumber: 1
zpe: 1345365.2 jmol-1
zpe.correction: 0.512423 hartree
zpe.thermalcorrener: 0.536448 hartree
zpe.thermalcorrenthalpy: 0.537392 hartree
zpe.thermalcorrgfe: 0.461566 hartree
zpe.sumelectzpe: -1044.394472 hartree
zpe.sumelectthermal: -1044.370446 hartree
zpe.sumelectthermalent: -1044.369502 hartree
zpe.sumelectthermalfe: -1044.445329 hartree
dipole: -0.4738 -1.5431 -4.4950
dipole: 4.7761
quadrupole: -184.9229 -141.8419 -143.9019
quadrupole: -5.2331 1.5675 -2.0051
quadrupole: -28.0340 15.0470 12.9870 -5.2331 1.5675 -2.0051
hfenergy: -1044.9068945 hartree
pointgroup: C01 [X(C21H34O3)]
dipole: 0.1853662 0.6193229 -1.7643513 debye
polarizability: 280.7231294|1.1379645|212.5974593|1.1882713|-2.5870172|182.0167176 unknown
InChI: InChI=1S/C21H34O3/c1-12(22)15-4-5-16-14-11-19(24)18-10-13(23)6-8-21(18,3)17(14)7-9-20(15,16)2/h13-19,23-24H,4-11H2,1-3H3
charge 0 multiplicity 1
58 atoms
O  -3.089249 -2.827477 -0.312304
O  -6.327627 0.400001 -0.058626
O  5.763325 0.158249 0.871745
C  -0.500178 0.555459 -0.299192
C  0.116873 -0.779611 0.226825
C  1.565224 -0.926072 -0.279266
C  2.496726 0.282344 0.05773
C  -1.967466 0.800906 0.258247
C  -2.679382 -0.579093 0.560344
C  0.442019 1.777301 -0.098505
C  1.889315 1.539407 -0.608802
C  -0.745244 -1.990163 -0.249746
C  3.844643 -0.256388 -0.58606
C  2.388206 -2.164265 0.146833
C  -2.235633 -1.63192 -0.475321
C  -2.756078 1.590703 -0.837788
C  3.861575 -1.777076 -0.213675
C  -4.219226 -0.458381 0.712522
C  -1.950348 1.605594 1.587175
C  2.685062 0.496906 1.583887
C  -4.269281 1.726632 -0.559049
C  -4.895644 0.327329 -0.416229
C  5.098577 0.500844 -0.145395
C  5.521839 1.694996 -0.994129
H  -0.595051 0.420828 -1.401899
H  0.118901 -0.761139 1.336564
H  1.497909 -0.947676 -1.393355
H  -2.301566 -0.944911 1.539071
H  0.491634 2.046247 0.971784
H  0.015566 2.657253 -0.619023
H  1.879805 1.401561 -1.711058
H  2.496652 2.441856 -0.395863
H  -0.31704 -2.405504 -1.186348
H  -0.711043 -2.794703 0.510591
H  3.739362 -0.131415 -1.683837
H  2.062083 -3.08577 -0.367113
H  2.281745 -2.343433 1.233628
H  -2.378123 -1.236905 -1.505492
H  -2.629411 1.073883 -1.812936
H  -2.303005 2.594381 -0.958793
H  4.548038 -1.939431 0.635173
H  4.242397 -2.373552 -1.06211
H  -4.652522 -1.470584 0.766387
H  -4.4671 0.05431 1.661987
H  -1.253512 1.152208 2.317733
H  -1.64865 2.656975 1.433913
H  -2.950255 1.615819 2.054528
H  3.277311 -0.312319 2.042795
H  3.22767 1.440278 1.779159
H  1.718871 0.552984 2.112967
H  -4.457979 2.297365 0.370518
H  -4.752052 2.285643 -1.387662
H  -4.782381 -0.218593 -1.380796
H  -2.767647 -3.531047 -0.931234
H  5.937288 1.330612 -1.954777
H  4.658128 2.337359 -1.244478
H  6.295322 2.282125 -0.474639
H  -6.799878 0.928569 -0.751899
