program: Gaussian 09
title: 000225964
version: EM64L-G09RevD.01
frameworkgroup: C1[X(C7H8Cl2N2O2)]
method: RPBEPBE
basis: SDD
operation: Freq
keyword: #p
keyword: freq=noraman
keyword: PBEPBE/SDD
title: #p freq=noraman PBEPBE/SDD
converged: YES YES NO NO
title: Mulliken charges:
elementType: Cl Cl O O N N C C C C C C C H H H H H H H H
charge: -0.054231 -0.028904 -0.393683 -0.277642 -0.352131 -0.123319 -0.186246 0.176799 0.192051 -0.576112 -0.106751 0.046167 -0.524935 0.257325 0.356467 0.359538 0.251300 0.235954 0.255059 0.259015 0.234279
chargesum: 0.00000
title: Mulliken charges with hydrogens summed into heavy atoms:
elementType: Cl Cl O O N N C C C C C C C
charge: -0.054231 -0.028904 -0.034146 -0.277642 0.004336 -0.123319 0.071078 0.176799 0.192051 -0.088858 0.148307 0.046167 -0.031641
polarizability: 1.92971019e+02 8.70988037e+00 1.20256459e+02 1.21123693e+00 1.41827738e+01 7.37609478e+01
1716.lowfreq: -7.2083 -0.0023 -0.0017 0.0021 1.6348 3.9719 17.5848 37.1952 41.1472
frequency: 17.5488 37.1743 41.1282 45.5295 76.0450 139.8919 157.7808 177.8512 204.0709 216.9961 251.1799 279.7281 306.9214 353.4906 407.4469 467.1124 500.8712 510.9620 564.1159 583.9043 591.2132 626.8231 662.1044 690.9238 701.0535 727.8325 735.4617 888.5542 932.6032 934.3389 941.4594 952.3516 980.4340 998.2416 1075.4641 1121.8601 1179.4343 1233.2433 1240.2379 1315.6829 1325.1975 1356.4364 1412.0510 1418.4271 1467.1930 1588.4464 1603.4260 1618.2506 1666.0335 2995.0560 3023.1510 3114.5500 3114.8961 3228.7875 3232.5860 3531.8831 3551.1339
redmass: 5.8296 6.7752 6.8305 8.3971 8.4532 6.0907 6.1321 4.7101 7.0883 5.4977 7.8579 1.1316 3.8266 3.4003 4.0277 4.3578 4.3593 7.9974 5.4962 5.5364 5.3814 3.7175 1.1128 1.1311 1.2823 6.4519 4.8727 2.6268 1.4268 2.0254 1.3463 2.4504 5.2261 1.5614 5.4466 1.6754 2.1840 3.2336 1.3924 1.2802 1.3551 1.3121 1.2453 1.2685 1.7902 6.2596 10.6053 5.9234 6.2415 1.0873 1.0849 1.0627 1.0640 1.1146 1.1148 1.0777 1.0661
irintensity: 0.0591 7.6765 1.0050 4.6474 1.3822 0.8868 2.6469 0.1912 0.8977 6.3143 2.5694 165.1093 8.4344 2.0296 6.8257 14.8234 24.2765 0.7904 33.1972 35.7599 12.5281 37.3912 0.2323 56.2093 53.1299 6.6051 42.8258 46.2044 147.2965 46.6052 62.9956 88.7303 67.5753 19.0149 39.2669 130.5839 147.8433 92.5290 40.6067 0.8924 114.5784 6.7624 26.2532 10.6644 560.0182 138.3998 191.1655 45.1319 26.2105 9.3855 14.6773 1.3652 0.6715 2.3614 1.4889 58.4097 16.4261
temp: 298.150 k
press: 1.00000 atm
elementType: 17 17 8 8 7 7 6 6 6 6 6 6 6 1 1 1 1 1 1 1 1
symmnumber: 1
zpe: 377520.9 jmol-1
zpe.correction: 0.143790 hartree
zpe.thermalcorrener: 0.158233 hartree
zpe.thermalcorrenthalpy: 0.159177 hartree
zpe.thermalcorrgfe: 0.098916 hartree
zpe.sumelectzpe: -1450.581333 hartree
zpe.sumelectthermal: -1450.566890 hartree
zpe.sumelectthermalent: -1450.565946 hartree
zpe.sumelectthermalfe: -1450.626207 hartree
dipole: -2.2427 -2.1427 -1.2033
dipole: 3.3270
quadrupole: -77.2047 -92.8340 -87.0788
quadrupole: 2.7573 -4.0465 -0.6265
quadrupole: 8.5012 -7.1281 -1.3730 2.7573 -4.0465 -0.6265
hfenergy: -1450.7251226 hartree
pointgroup: C01 [X(C7H8Cl2N2O2)]
dipole: -0.878327 -0.9661846 0.0913921 debye
dipolederiv: -0.1832081 -0.0155724 0.0816793 -0.0224154 -0.6007661 0.1548664 0.1138047 0.2432516 -0.1748799 -0.1157866 0.040677 -0.0273244 0.093913 -0.5348588 0.2272021 -0.0537233 0.2249087 -0.147146 -0.6855035 0.0670111 -0.2080628 0.0304744 -0.4708083 -0.2241566 -0.4129923 -0.2343675 -0.7107806 -0.8428512 0.0208828 -0.0479691 -0.0178785 -0.8004502 0.2796081 -0.0760468 0.2605267 -0.5053697 -1.7490808 -0.3775357 0.0318405 -0.185224 -0.4672643 -0.0157024 0.0871922 -0.0731565 -0.5899884 -1.5565692 0.0526841 -0.1898383 -0.1015745 -0.2760481 0.0207125 -0.1483562 0.0317735 -0.2627943 1.4140777 0.1054937 0.1327736 -0.327686 0.1604408 0.3771377 0.3360952 0.362543 0.9116242 -0.010431 -0.0444838 -0.1382806 -0.0097028 1.0006238 -0.2994366 -0.3474054 -0.3633106 0.1131282 2.3278376 0.2462719 0.068053 0.2746795 1.0021411 -0.4408847 0.173071 -0.3713134 0.4739593 -0.3180959 0.0508456 -0.1056946 0.0286538 -0.3206353 -0.0533356 0.0027559 -0.0676622 -0.2022611 1.0955498 0.0247327 0.1292463 0.270884 0.0522647 0.0459116 0.0268508 0.0144142 0.0773156 -0.3279572 0.0572153 -0.056125 -0.2393266 0.8724189 -0.4453987 0.0574801 -0.4148987 0.1062845 -0.0974451 -0.1208862 0.0879613 0.1188014 -0.2369514 -0.0142587 -0.02014 -0.044921 -0.2759102 0.079463 -0.0511767 0.0125546 0.0628771 -0.0538979 -0.0500982 -0.0105206 0.0163607 0.0110855 0.2629593 -0.0290668 -0.0303843 0.0970472 0.2362889 0.0614925 -0.0882984 0.0461907 0.3209134 0.2151052 -0.0652723 0.1783478 -0.0816854 0.2841456 0.022442 0.2409486 0.0284514 0.2166045 0.1235593 0.0026698 0.1082231 0.0116216 0.1137265 0.0391842 0.1381875 0.0397607 0.0713248 0.1477029 -0.003954 0.0477075 -0.0288291 -0.018905 0.0841381 0.0323087 0.0683028 0.1079093 0.0604342 -0.0115771 -0.0146307 -0.0460086 -0.0287516 0.0861187 0.0160423 0.0908562 0.1422165 0.0365668 0.0389051 -0.0416658 0.0348945 0.1011492 0.0473065 -0.0399051 0.0479095 0.1674274 0.1236731 0.0121357 -0.0184111 0.0364845 -0.0138626 0.0971511 -0.0273488 0.0943805 0.1493368 unknown
polarizability: 192.9779115|8.5224622|118.0059388|-2.0077958|-17.3373789|76.0045763 unknown
InChI: InChI=1S/C7H8Cl2N2O2/c1-4(8)3-10-7(13)11-6(12)5(2)9/h3,6,11-12H,1-2H2
charge 0 multiplicity 1
21 atoms
Cl 3.360622 1.683405 -1.236185
Cl -3.807324 1.694322 -1.059902
O  2.797575 0.703718 1.712084
O  -0.14795 -1.627857 1.089831
N  0.928467 0.272195 0.231018
N  -1.369407 0.168151 -0.003036
C  2.278773 -0.127484 0.620162
C  3.260166 -0.003058 -0.52512
C  -0.179294 -0.508947 0.495533
C  4.012493 -0.998874 -1.032198
C  -2.493333 -0.491921 0.1174
C  -3.786695 0.035567 -0.320742
C  -4.947126 -0.664839 -0.192471
H  2.212259 -1.190301 0.924155
H  0.779915 1.169133 -0.241146
H  2.209421 0.586022 2.502774
H  4.702343 -0.844301 -1.865605
H  3.947039 -2.004307 -0.602134
H  -2.526963 -1.504715 0.567789
H  -5.909912 -0.265228 -0.520715
H  -4.933169 -1.666183 0.253007
