program: Gaussian 09
title: 000225970
version: EM64L-G09RevD.01
frameworkgroup: C1[X(C17H14O4)]
method: RPBEPBE
basis: SDD
operation: Freq
keyword: #pfreq=noraman
keyword: PBEPBE/SDD
title: #p freq=noraman PBEPBE/SDD
converged: YES YES NO NO
title: Mulliken charges:
elementType: O O O O C C C C C C C C C C C C C C C C C H H H H H H H H H H H H H H
charge: -0.422531 -0.222083 -0.408759 -0.240003 -0.415532 -0.140773 0.295246 0.257877 0.151293 0.150433 -0.536563 -0.439570 -0.397633 0.147079 -0.399191 -0.406367 -0.245459 -0.254127 -0.233250 -0.230948 0.187399 0.289823 0.279442 0.291360 0.280928 0.249003 0.251649 0.242266 0.241952 0.229216 0.229532 0.228390 0.227616 0.382916 0.379367
chargesum: 0.00000
title: Mulliken charges with hydrogens summed into heavy atoms:
elementType: O O O O C C C C C C C C C C C C C C C C C
charge: -0.039615 -0.222083 -0.029392 -0.240003 -0.125708 0.138669 0.295246 0.257877 0.151293 0.150433 0.035725 -0.190566 -0.145984 0.147079 -0.156925 -0.164415 -0.016242 -0.024595 -0.004861 -0.003332 0.187399
polarizability: 1.97596742e+02 -1.56422415e+01 2.39237433e+02 3.01934019e+01 2.05295293e+01 1.38293740e+02
1716.lowfreq: -5.5687 -3.2286 -0.0009 -0.0006 0.0005 5.8277 26.0990 32.7964 40.3541
frequency: 26.0792 32.7810 40.3523 50.4227 65.8449 87.5530 96.4503 133.0072 154.8807 165.1250 199.5134 236.3780 270.7969 292.5709 347.7892 406.4132 409.7174 432.4704 446.0811 481.5919 504.4791 509.6988 513.8590 559.8640 569.6198 574.1293 612.4264 617.9310 625.6640 640.8486 659.9177 691.7288 734.2571 744.8374 749.2340 767.8340 792.4136 793.8919 819.9853 861.0032 875.6880 885.3819 895.1986 948.4993 950.5699 971.6242 986.5347 988.5447 996.3312 1008.2029 1023.3960 1031.9876 1040.0449 1063.7931 1097.7592 1112.6841 1121.2256 1166.1803 1171.6014 1177.4458 1185.8846 1188.5846 1203.7304 1227.8558 1244.8994 1254.0900 1259.7924 1290.9058 1304.8608 1311.3863 1345.6440 1377.4430 1380.0826 1402.7519 1425.1502 1439.4980 1444.4067 1469.0199 1482.7404 1590.3406 1592.4144 1617.4065 1620.3137 1658.6384 1663.0164 2991.7109 3012.8672 3019.1628 3080.2521 3121.0687 3125.2308 3129.0462 3136.1543 3143.3739 3148.2626 3162.5342 3164.3105 3514.2320 3519.7001
redmass: 7.8134 9.4510 5.7771 5.4051 8.5769 6.3124 4.7596 4.3085 5.5116 4.4591 5.3751 4.9031 3.6165 4.3693 6.6936 3.6130 5.9281 3.9087 2.9728 2.2406 3.2907 3.8794 3.6487 3.8911 3.6762 2.9934 3.0932 6.7610 1.9383 1.4995 4.3016 4.2692 4.9894 1.7095 1.6729 2.8718 2.1580 3.4514 3.2174 2.5227 1.6392 1.8528 3.1224 1.4488 1.4467 3.2473 1.3409 1.3302 6.6321 3.2549 2.2755 2.0262 2.5310 2.4148 1.9534 1.7405 2.0952 1.4234 1.1231 1.2130 1.4148 1.3098 2.1550 1.3677 1.7286 1.6352 1.6633 1.5571 1.9127 1.5684 1.9110 5.4362 2.2579 3.8926 1.0893 2.2323 2.6899 2.6044 3.9249 6.4957 6.9337 7.2959 6.9661 8.4314 8.4937 1.0821 1.0638 1.0818 1.0966 1.0868 1.0857 1.0886 1.0894 1.0941 1.0947 1.1001 1.1002 1.0639 1.0642
irintensity: 0.3904 1.1006 0.0734 0.3016 0.8904 0.1689 0.8031 1.3612 3.9528 0.1432 1.3437 0.2037 3.6778 0.3369 0.5928 0.4326 0.5287 14.5986 0.3666 13.7194 7.2928 5.4576 82.0172 4.9247 9.6995 82.5249 35.0343 3.1883 80.9032 92.4640 8.1481 10.8167 2.4998 14.4546 100.9217 31.7086 0.8173 15.2817 13.0953 11.6828 0.5559 3.5061 4.8431 2.5167 3.4664 14.3664 0.5193 0.0944 2.7629 23.2248 5.5570 8.3952 247.4581 271.9111 1.2257 1.0881 17.1387 4.6446 2.5071 7.6008 0.6171 9.3649 3.0489 4.7814 3.3500 2.4789 1.3685 11.4072 1.3703 16.4420 78.0884 17.7298 41.1882 0.8484 28.6312 28.0213 14.8510 10.7901 1.5102 0.6189 0.3575 2.5529 0.6150 240.8090 137.8015 2.7487 5.3844 4.6402 0.3659 4.8605 3.1725 3.0544 3.7083 18.6478 30.3188 43.7805 20.1432 27.2214 32.4610
temp: 298.150 k
press: 1.00000 atm
elementType: 8 8 8 8 6 6 6 6 6 6 6 6 6 6 6 6 6 6 6 6 6 1 1 1 1 1 1 1 1 1 1 1 1 1 1
symmnumber: 1
zpe: 702691.8 jmol-1
zpe.correction: 0.267641 hartree
zpe.thermalcorrener: 0.285479 hartree
zpe.thermalcorrenthalpy: 0.286423 hartree
zpe.thermalcorrgfe: 0.219683 hartree
zpe.sumelectzpe: -955.668856 hartree
zpe.sumelectthermal: -955.651018 hartree
zpe.sumelectthermalent: -955.650074 hartree
zpe.sumelectthermalfe: -955.716815 hartree
dipole: 1.7813 -0.1521 -0.0813
dipole: 1.7896
quadrupole: -119.0333 -111.9645 -115.5485
quadrupole: -1.9279 5.6292 -3.7419
quadrupole: -3.5179 3.5509 -0.0331 -1.9279 5.6292 -3.7419
hfenergy: -955.9364976 hartree
pointgroup: C01 [X(C17H14O4)]
dipole: 0.7018721 -0.0557277 -0.0002573 debye
polarizability: 200.9296903|21.0465097|235.513783|-30.8414895|18.6893443|138.6844424 unknown
InChI: InChI=1S/C17H14O4/c18-15(19)9-14(17(20)21)16-12-7-3-1-5-10(12)11-6-2-4-8-13(11)16/h1-8,14,16,18,20H,9H2
charge 0 multiplicity 1
35 atoms
O  -2.455456 0.022085 2.675323
O  -3.327542 -0.922052 0.744183
O  -2.981716 1.338382 -2.69868
O  -3.357385 2.256687 -0.601346
C  0.050825 0.029981 1.043029
C  -1.35319 0.586879 0.607635
C  1.201933 0.937274 0.601895
C  0.444758 -1.319464 0.430289
C  2.154552 0.196887 -0.159304
C  1.686088 -1.198664 -0.266409
C  -1.54659 0.596845 -0.917257
C  1.399952 2.303867 0.863792
C  -0.218608 -2.558688 0.489125
C  -2.479282 -0.183256 1.288712
C  3.315772 0.825857 -0.659767
C  2.266216 -2.316412 -0.904675
C  2.564432 2.936362 0.359048
C  0.362577 -3.6803 -0.155025
C  3.513029 2.201539 -0.395604
C  1.594182 -3.559415 -0.844869
C  -2.708567 1.476245 -1.333909
H  0.031756 -0.040577 2.149182
H  -1.424895 1.621877 0.993185
H  -1.718577 -0.419891 -1.309614
H  -0.634085 0.98071 -1.411806
H  0.674715 2.878917 1.451706
H  -1.173133 -2.669699 1.013955
H  4.054327 0.264208 -1.24261
H  3.219537 -2.229043 -1.437914
H  2.734488 4.000677 0.5554
H  -0.146857 -4.649562 -0.119969
H  4.407631 2.706356 -0.777045
H  2.02785 -4.437656 -1.33612
H  -3.20667 -0.477241 3.096155
H  -3.743767 1.931687 -2.941392
