program: Gaussian 09
title: 000225959
version: EM64L-G09RevD.01
frameworkgroup: C1[X(C10H19NO2)]
method: RPBEPBE
basis: SDD
operation: Freq
keyword: #p
keyword: freq=noraman
keyword: PBEPBE/SDD
title: #p freq=noraman PBEPBE/SDD
converged: YES YES NO NO
title: Mulliken charges:
elementType: O O N C C C C C C C C C C H H H H H H H H H H H H H H H H H H H
charge: -0.285059 -0.253518 -0.573385 -0.092723 -0.014356 -0.004390 -0.431009 -0.444436 -0.412138 -0.482834 -0.774248 0.289728 -0.765210 0.209081 0.183553 0.238275 0.247042 0.177438 0.203663 0.229995 0.205855 0.200496 0.209741 0.204592 0.215114 0.241414 0.206812 0.258687 0.275651 0.246681 0.245362 0.244127
chargesum: 0.00000
title: Mulliken charges with hydrogens summed into heavy atoms:
elementType: O O N C C C C C C C C C C
charge: -0.285059 -0.253518 -0.039047 0.116358 0.169197 0.233884 -0.006529 -0.010779 -0.005787 -0.068500 -0.110908 0.289728 -0.029041
polarizability: 1.47436757e+02 -2.34174853e+00 1.11100911e+02 8.21788733e-01 3.38495401e+00 9.93445858e+01
1716.lowfreq: -26.1296 -4.4385 -0.0007 -0.0006 -0.0001 9.9177 41.8163 51.3310 55.0868
frequency: 41.7995 51.1023 55.0772 76.5878 96.9443 108.4362 158.6206 179.5898 199.8992 212.6449 247.8430 277.0304 314.8087 325.3845 340.5162 402.8692 427.9847 458.3139 479.6083 516.3150 543.2155 568.4178 625.1190 630.1811 790.5233 813.9797 829.8632 863.6167 881.1439 899.9787 925.2279 945.5860 980.8649 989.9314 999.8795 1013.4224 1041.7234 1057.4346 1069.8543 1083.7584 1106.6135 1129.3132 1150.0327 1170.5086 1171.2578 1203.8713 1217.3695 1245.4360 1262.2565 1277.8890 1294.2859 1302.7847 1311.0797 1327.2601 1334.5519 1342.1922 1345.1632 1349.9471 1376.8450 1381.7718 1387.7114 1453.8315 1455.6927 1465.0298 1467.9561 1470.8096 1475.7524 1483.3020 1489.7023 1638.5378 1640.5644 2912.4944 2918.4260 2955.7395 2963.9410 2973.5234 2977.4205 2985.1462 3003.5267 3004.2947 3009.8578 3037.9729 3055.7729 3061.0733 3071.9930 3090.3556 3097.2804 3137.7207 3450.5808 3577.6064
redmass: 4.6763 1.9122 1.6010 2.9580 2.3190 2.6075 2.7370 1.3190 1.2505 2.6961 3.2243 2.1939 2.5649 2.5900 2.7530 3.1809 2.8946 3.1000 3.5237 2.2456 2.1167 3.1893 1.4007 3.9016 2.4798 2.2596 2.1467 1.6844 2.6431 1.8891 2.3643 2.1585 1.3393 1.7660 1.9628 1.4846 1.6536 2.5095 1.2835 3.0808 2.4517 2.2395 2.3099 1.6975 1.8957 3.3923 1.3840 1.3634 1.3965 1.2103 1.2671 1.2529 1.2298 1.3988 1.4653 1.4599 1.4633 1.6322 1.3870 1.2442 1.2124 1.0605 1.0530 1.0853 1.0838 1.0640 1.0909 1.0796 1.0461 1.1022 8.9077 1.0742 1.0725 1.0733 1.0785 1.0622 1.0395 1.0634 1.0788 1.0422 1.0926 1.0975 1.0989 1.0977 1.0960 1.0986 1.0945 1.1022 1.0450 1.0972
irintensity: 0.8435 1.2484 0.7076 2.0070 2.3005 0.5544 6.3545 10.2740 28.5918 14.5092 2.3535 5.3294 3.6657 5.1400 1.3402 0.5885 0.1387 8.7500 8.3721 9.0091 18.0956 2.7014 174.9508 2.2281 4.1841 6.5833 0.6860 3.0154 6.3558 3.3251 34.0056 110.0707 9.3569 23.2833 56.4946 2.1404 9.8738 1.6157 2.2598 5.6178 7.8992 36.5414 0.1880 5.6415 5.2636 362.9873 11.6974 3.7603 1.5843 3.3991 4.8237 3.4931 1.7793 0.2188 0.2626 0.6036 0.5949 2.3411 12.8133 45.5860 21.9384 21.9662 17.9916 9.3845 12.4474 4.6133 9.0873 2.9873 17.8882 44.0913 184.8993 59.8597 42.4106 5.6399 29.1524 45.6846 32.0433 10.1662 14.0721 9.7339 64.9833 61.8718 20.9640 36.8065 46.6174 31.0795 9.8462 10.7226 1.0804 0.4948
temp: 298.150 k
press: 1.00000 atm
elementType: 8 8 7 6 6 6 6 6 6 6 6 6 6 1 1 1 1 1 1 1 1 1 1 1 1 1 1 1 1 1 1 1
symmnumber: 1
zpe: 732946.8 jmol-1
zpe.correction: 0.279165 hartree
zpe.thermalcorrener: 0.294224 hartree
zpe.thermalcorrenthalpy: 0.295168 hartree
zpe.thermalcorrgfe: 0.236571 hartree
zpe.sumelectzpe: -596.613573 hartree
zpe.sumelectthermal: -596.598514 hartree
zpe.sumelectthermalent: -596.597569 hartree
zpe.sumelectthermalfe: -596.656167 hartree
dipole: -1.7137 -1.7087 -1.3080
dipole: 2.7508
quadrupole: -74.4871 -79.9793 -81.3912
quadrupole: 1.6465 -8.7870 -2.1055
quadrupole: 4.1321 -1.3601 -2.7720 1.6465 -8.7870 -2.1055
hfenergy: -596.8927376 hartree
pointgroup: C01 [X(C10H19N1O2)]
dipole: -0.7116053 0.6275391 0.5206705 debye
polarizability: 147.2356502|3.5455703|111.0314524|0.4709964|3.9055243|99.6151509 unknown
InChI: InChI=1S/C10H19NO2/c1-7-9(6-11)4-3-5-10(7)13-8(2)12/h7,9-10H,3-6,11H2,1-2H3
charge 0 multiplicity 1
32 atoms
O  1.81124 0.422634 0.571822
O  3.156614 -0.355279 -1.173645
N  -4.40604 0.282925 -0.407308
C  -0.60939 0.701716 0.340803
C  -1.928405 0.046266 -0.18658
C  0.591025 -0.179459 -0.077036
C  -2.047249 -1.426574 0.278238
C  0.480118 -1.645867 0.369258
C  -0.831803 -2.26863 -0.16126
C  -3.190809 0.848877 0.22167
C  -0.402866 2.153204 -0.153295
C  3.034228 0.23898 -0.076753
C  4.162591 0.833986 0.740428
H  -0.647606 0.701897 1.451845
H  -1.873508 0.050358 -1.301086
H  0.742972 -0.130362 -1.174259
H  -2.992274 -1.843668 -0.112047
H  -2.122339 -1.444916 1.386884
H  0.487735 -1.681611 1.476773
H  1.360183 -2.207177 0.005917
H  -0.926624 -3.308351 0.205283
H  -0.796189 -2.323256 -1.268897
H  -3.041651 1.925727 -0.019083
H  -3.313746 0.777788 1.320929
H  -1.143804 2.847345 0.279384
H  0.599784 2.5146 0.132745
H  -0.487143 2.209621 -1.256395
H  -4.426034 0.394846 -1.426824
H  -5.28381 0.589533 0.022575
H  4.484611 0.104402 1.506089
H  3.833142 1.74602 1.262656
H  5.019948 1.051527 0.085869
