program: Gaussian 09
title: 000225929
version: EM64L-G09RevD.01
frameworkgroup: C1[X(C10H10ClNO2)]
method: RPBEPBE
basis: SDD
operation: Freq
keyword: #p
keyword: freq=noraman
keyword: PBEPBE/SDD
title: #p freq=noraman PBEPBE/SDD
converged: YES YES NO NO
title: Mulliken charges:
elementType: Cl O O N C C C C C C C C C C H H H H H H H H H H
charge: -0.032662 -0.222973 -0.215424 0.031149 -0.510500 0.388354 0.447139 -0.401774 -0.684503 -0.367754 -0.346958 -0.223292 -0.229265 -0.113897 0.261189 0.226488 0.275020 0.213749 0.229178 0.252036 0.246608 0.253812 0.263336 0.260943
chargesum: 0.00000
title: Mulliken charges with hydrogens summed into heavy atoms:
elementType: Cl O O N C C C C C C C C C C
charge: -0.032662 -0.222973 -0.215424 0.031149 -0.022823 0.388354 0.447139 -0.126753 0.010460 -0.121146 -0.093146 0.040045 0.031678 -0.113897
polarizability: 2.72915469e+02 2.58884394e+00 1.31780813e+02 1.56901838e+00 2.95445898e+00 6.27625849e+01
1716.lowfreq: -8.0520 -3.5511 -0.0021 -0.0021 -0.0007 9.3776 35.3818 51.6389 62.3618
frequency: 35.3575 51.6360 62.3611 82.4916 130.9579 164.9397 191.8749 212.7711 229.4398 265.4202 324.1843 358.1740 378.4327 414.9360 435.9363 477.1965 505.7052 561.8154 616.6510 634.2756 687.1236 694.9890 723.2270 769.1250 795.1930 826.8617 834.6203 837.5207 932.9667 945.2352 963.1340 973.2895 997.6996 1033.4228 1068.6076 1077.0715 1109.5722 1127.8478 1178.6656 1197.1603 1227.8461 1275.0996 1302.8408 1316.7351 1349.4996 1368.7537 1384.9896 1397.3552 1406.7313 1465.8885 1473.4270 1482.6421 1491.4900 1567.0876 1596.0576 1644.6422 2987.8055 3017.1126 3067.5162 3085.2869 3101.4200 3110.5289 3140.1896 3163.1108 3174.8694 3188.2454
redmass: 4.2834 9.3317 7.7242 4.4188 4.1585 6.2423 3.5895 1.2838 4.8958 4.9641 5.0416 3.0707 4.0443 2.9170 9.4182 4.6112 3.3936 3.9061 5.8988 5.4420 4.6535 5.7437 3.8950 2.9969 1.8260 1.3185 1.5513 3.2754 2.3272 1.3759 1.4011 1.4264 3.9707 2.7973 1.6922 2.7529 1.6032 1.5511 7.8748 1.1852 1.9903 1.2574 1.3319 1.3458 4.1326 3.7659 1.8096 1.9876 2.2331 1.1809 1.0744 2.0257 1.0576 6.9690 6.0476 8.2463 1.0358 1.0599 1.0996 1.1004 1.1006 1.0873 1.0899 1.0897 1.0960 1.0953
irintensity: 0.2816 2.7734 0.4031 0.6729 2.0405 0.8424 0.1533 0.6353 0.0558 1.4507 2.4032 1.6075 5.8076 0.6337 13.6935 10.9202 19.9297 8.9743 2.0494 5.7414 5.3310 9.0889 1.9582 45.7420 8.1242 1.0413 48.5658 3.1459 60.2124 23.3071 3.8518 10.0587 40.5734 22.4744 10.0415 101.8718 11.1225 7.5887 468.1226 18.7018 8.6552 0.5081 4.5160 1.4073 65.3210 71.7037 10.9254 5.7180 13.1690 15.9962 3.4955 75.9761 12.9640 2.2916 99.1471 66.4013 26.7847 13.3156 4.3060 37.6620 16.3077 0.5662 3.8277 1.1681 3.8231 2.5877
temp: 298.150 k
press: 1.00000 atm
elementType: 17 8 8 7 6 6 6 6 6 6 6 6 6 6 1 1 1 1 1 1 1 1 1 1
symmnumber: 1
zpe: 470701.0 jmol-1
zpe.correction: 0.179281 hartree
zpe.thermalcorrener: 0.192576 hartree
zpe.thermalcorrenthalpy: 0.193521 hartree
zpe.thermalcorrgfe: 0.137777 hartree
zpe.sumelectzpe: -1051.209428 hartree
zpe.sumelectthermal: -1051.196132 hartree
zpe.sumelectthermalent: -1051.195188 hartree
zpe.sumelectthermalfe: -1051.250931 hartree
dipole: -3.5651 1.7781 0.3343
dipole: 3.9979
quadrupole: -117.6249 -82.0295 -90.6219
quadrupole: 10.5078 1.0850 -1.0911
quadrupole: -20.8661 14.7293 6.1368 10.5078 1.0850 -1.0911
hfenergy: -1051.3887085 hartree
pointgroup: C01 [X(C10H10Cl1N1O2)]
dipole: 1.4373063 -0.6199033 0.1545914 debye
dipolederiv: -1.086663 0.0591931 0.0254445 0.1140527 -0.1199647 0.0007989 0.0055194 0.0032453 -0.0538423 -0.6382854 0.1396273 -0.0317098 0.4591899 -0.7389527 0.1897838 -0.1829118 0.2384102 -0.3170052 -1.0399725 -0.2067068 0.1587804 -0.1942777 -0.5185651 0.1362928 0.1712537 0.1356495 -0.3035405 2.1896779 0.0076047 -0.1552118 -0.6135952 0.9132829 -0.2854223 0.108262 -0.341014 0.3087927 0.0138181 -0.0195128 0.0295363 -0.0703696 -0.0916708 0.0420853 -0.0654219 0.0056427 0.0665896 -1.3023965 0.070194 0.0524634 0.0973803 0.2709999 -0.1399054 -0.0147636 -0.1788127 0.0111184 -0.4568691 0.0775703 0.0053135 0.1084537 -0.0466252 -0.0009049 -0.0734086 -0.0051336 0.0131129 1.0382634 -0.0447466 -0.0647468 0.1450851 -0.1126578 -0.0198094 -0.088424 0.0295539 -0.0855791 0.0683619 0.0185011 -0.0387717 -0.0037772 0.0465375 -0.0182852 0.0471531 0.0290139 0.0162376 0.2256204 -0.1056829 -0.001541 0.1948234 0.0772362 -0.0227915 -0.0943915 -0.0120478 -0.1284017 0.2303476 0.0351211 0.0053213 -0.2204729 0.0492979 0.0087772 0.0884333 0.0041658 -0.1223917 -0.430663 0.1599153 0.0021414 0.3134171 -0.0397844 -0.0217986 0.0101832 0.0011554 -0.1020268 -0.5892543 -0.0740047 0.0189716 -0.2398733 0.0051169 0.0124546 0.0064558 -0.0039586 -0.0983718 1.5140675 -0.1145069 -0.0227641 -0.109883 0.1853956 -0.0157926 -0.00531 -0.0150162 -0.0580185 0.0290158 -0.0274892 0.118881 0.0027661 0.069109 -0.026834 0.0655769 -0.0207879 0.0109184 -0.0519158 0.0266684 -0.1339829 -0.0013992 0.0203972 -0.006641 -0.0763611 -0.021665 0.0568914 0.0998049 -0.0167998 0.0037135 0.0368714 0.0263825 0.0456265 0.0597639 0.0421698 0.1409802 -0.0152613 0.0251917 0.1364431 -0.0121978 0.0684228 0.0007534 0.1066075 -0.0195055 -0.0506173 0.0971565 0.0170902 -0.0103813 -0.0618747 -0.1567808 0.0852501 -0.0132758 0.0937143 0.0286824 -0.0725658 -0.027491 -0.0900467 0.0753473 0.1150852 -0.0010474 -0.0469574 0.0014357 0.0525386 0.0444654 0.0876938 -0.0100076 0.0484012 -0.0259769 0.011586 -0.0067419 0.0123468 0.1533296 0.0505806 -0.0650115 -0.0069368 -0.0593238 -0.0125933 0.0078042 -0.0012741 0.0065193 0.1309026 0.0275922 -0.0697296 0.0077935 -0.0670833 0.023019 0.0125647 0.0094236 0.0115254 0.1660066 0.0550745 0.0473108 0.0012968 0.0583392 -0.0067108 0.0054547 -0.0093906 0.0033934 0.1636939 unknown
polarizability: 271.8619656|7.3059354|130.0994277|-11.7119659|-12.6127162|65.4974735 unknown
InChI: InChI=1S/C10H10ClNO2/c1-2-10(12(13)14)7-8-3-5-9(11)6-4-8/h3-7H,2H2,1H3
charge 0 multiplicity 1
24 atoms
Cl 5.278847 -0.0709 -0.072713
O  -3.304194 1.730636 -0.346914
O  -4.195662 -0.149631 0.579492
N  -3.184085 0.561058 0.193148
C  -1.820123 -1.393794 1.038567
C  -1.822673 -0.034987 0.38288
C  0.661319 0.47257 -0.038159
C  -0.778898 0.748209 -0.038171
C  -2.103375 -2.560162 0.05281
C  1.537586 1.595344 -0.149845
C  1.249069 -0.827096 0.028023
C  2.936635 1.444453 -0.151655
C  2.647427 -0.994353 0.015569
C  3.474902 0.144604 -0.063048
H  -2.601147 -1.40478 1.819014
H  -0.84918 -1.53781 1.544087
H  -1.072135 1.738258 -0.41519
H  -1.374578 -2.585205 -0.778008
H  -2.056954 -3.527741 0.583342
H  -3.112805 -2.456447 -0.379849
H  1.110631 2.602105 -0.224101
H  0.619715 -1.719509 0.048946
H  3.594992 2.314262 -0.226311
H  3.088888 -1.99428 0.055582
