program: Gaussian 09
title: 000225925
version: EM64L-G09RevD.01
frameworkgroup: C1[X(C21H16O5)]
method: RPBEPBE
basis: SDD
operation: Freq
keyword: #pfreq=noraman
keyword: PBEPBE/SDD
title: #p freq=noraman PBEPBE/SDD
converged: NO YES NO NO
title: Mulliken charges:
elementType: O O O O O C C C C C C C C C C C C C C C C C C C C C H H H H H H H H H H H H H H H H
charge: -0.227874 -0.267232 -0.267229 -0.255638 -0.255640 -0.560639 -0.560643 0.300135 0.300139 -0.184603 -0.450564 -0.450562 0.528724 0.528713 -0.444554 -0.444546 0.173225 0.173229 -0.430290 -0.430291 0.163473 0.163472 -0.348382 -0.348379 -0.203441 -0.203443 0.237951 0.237506 0.237941 0.237513 0.272172 0.272171 0.273293 0.273290 0.243725 0.243723 0.255154 0.255153 0.240772 0.240851 0.240796 0.240828
chargesum: 0.00000
title: Mulliken charges with hydrogens summed into heavy atoms:
elementType: O O O O O C C C C C C C C C C C C C C C C C C C C C
charge: -0.227874 -0.267232 -0.267229 -0.255638 -0.255640 -0.085182 -0.085189 0.300135 0.300139 -0.184603 -0.178392 -0.178391 0.528724 0.528713 -0.171261 -0.171255 0.173225 0.173229 -0.186565 -0.186568 0.163473 0.163472 -0.093229 -0.093226 0.278183 0.278181
polarizability: 6.69961990e+02 1.37982297e-03 2.55981246e+02 2.96200858e-01 -1.58070460e-02 1.07578236e+02
1716.lowfreq: -39.9465 -39.3012 -4.7228 -0.0011 -0.0007 0.0008 2.4039 7.6277 15.3707
frequency: -39.9414 -39.3007 15.3612 19.8873 34.9278 58.4604 62.2664 95.1205 96.6682 142.2434 145.0354 191.8859 197.4235 217.1167 225.5160 229.6763 234.7737 296.0229 313.1859 340.6624 403.2626 409.0805 413.7093 416.2764 463.5562 476.6763 478.4122 517.8118 575.3502 585.3462 612.0322 614.0098 623.6353 641.8755 679.5157 680.0050 687.2017 696.9945 723.3712 730.2510 755.1739 759.8682 779.3586 787.4876 793.2663 816.1094 819.2181 838.9523 840.4762 842.4104 863.2251 872.9798 906.1452 921.2221 932.7077 937.3692 964.4827 973.3130 977.5560 978.2490 988.2908 1001.8847 1007.4581 1055.9447 1061.2467 1064.2492 1064.2531 1098.5396 1120.0800 1120.0872 1132.9570 1136.6640 1160.0087 1188.8784 1202.1995 1213.3986 1225.2057 1235.5812 1270.9538 1270.9591 1271.6891 1285.5800 1304.2403 1354.7215 1355.8233 1367.9357 1368.3427 1400.5859 1402.7626 1448.1789 1452.1929 1455.9528 1470.9530 1477.6628 1478.8398 1487.0094 1487.3247 1547.7940 1594.1730 1596.2543 1618.5440 1621.9357 1628.5493 1655.1866 2971.4260 2984.1487 3014.7047 3015.8638 3016.1188 3036.9889 3073.2048 3074.5182 3094.8580 3094.8751 3146.8187 3146.8328 3184.1053 3184.1497 3216.8665 3217.0313
redmass: 2.3124 2.3036 4.7141 6.0874 7.2305 7.1306 5.7075 6.0687 6.5330 1.9627 6.7074 6.5265 5.9003 6.9592 8.8436 6.0051 5.9487 6.1221 5.8322 6.4719 3.0979 5.2692 2.9319 4.7731 3.0616 7.9087 2.8271 7.1285 6.9280 8.6817 3.3792 3.8348 7.4779 6.2477 8.3174 9.8110 6.2996 3.3877 3.5660 3.3417 6.8191 6.3910 5.8955 6.2330 5.8272 1.3407 1.3729 10.2048 10.4739 1.4940 1.5095 1.5790 4.7458 3.9226 1.3465 1.3542 1.5367 5.9101 5.0496 1.5215 2.8532 1.7541 3.0971 3.8219 4.0995 1.4581 1.4581 4.1648 1.0366 1.0366 1.5229 1.4409 1.1245 1.9210 1.7885 2.5290 1.1040 1.4306 1.6910 2.7488 2.0342 1.4923 2.2626 2.5245 2.3422 1.4469 1.4929 2.1528 2.0210 1.6953 3.9571 1.7644 1.1199 2.2084 2.0367 1.3502 1.4242 11.7550 7.9223 7.8786 7.8886 8.2543 8.4003 9.3432 1.0588 1.0614 1.1025 1.0534 1.0535 1.1023 1.0874 1.0876 1.1190 1.1190 1.0898 1.0898 1.0958 1.0959 1.0915 1.0915
irintensity: 0.1963 27.8401 0.0000 0.0220 0.1594 0.0001 5.5158 0.0975 0.4618 0.0002 0.0176 0.0003 0.0017 0.0130 4.7116 0.7639 0.0000 9.3993 0.2942 0.0002 3.3639 4.6997 0.0002 7.7138 10.4555 83.4969 0.0024 1.6182 0.0046 1.1583 36.2572 0.0007 3.9204 10.8871 0.0508 0.1895 0.3913 6.9532 0.0005 5.3494 8.1860 6.6754 2.5368 0.5961 23.2313 0.0040 76.0212 4.2049 40.7151 5.9276 0.0020 36.7482 40.2521 0.6485 0.0010 7.2685 0.0022 80.5560 138.6531 33.3785 232.8125 0.2827 21.9265 9.9651 32.7763 1.6770 6.8734 1.8058 0.0008 0.0011 12.1990 1.7912 0.4940 377.8789 60.9849 894.2273 0.0998 30.2282 202.6849 169.8878 5.2094 5.8504 5.8434 53.2679 7.5446 36.0262 0.9800 58.9490 15.6210 179.0185 121.6682 62.5680 0.1239 278.6155 62.4627 87.8611 46.2316 151.2962 136.3814 7.7344 329.8334 0.0241 320.7457 0.1405 25.5166 22.7320 0.0268 207.2499 124.8875 28.4329 0.2062 2.3640 10.8656 49.5195 2.0166 7.1950 17.1391 2.6245 1.8246 3.2737
temp: 298.150 k
press: 1.00000 atm
elementType: 8 8 8 8 8 6 6 6 6 6 6 6 6 6 6 6 6 6 6 6 6 6 6 6 6 6 1 1 1 1 1 1 1 1 1 1 1 1 1 1 1 1
symmnumber: 1
zpe: 830972.5 jmol-1
zpe.correction: 0.316501 hartree
zpe.thermalcorrener: 0.336484 hartree
zpe.thermalcorrenthalpy: 0.337429 hartree
zpe.thermalcorrgfe: 0.265006 hartree
zpe.sumelectzpe: -1184.070439 hartree
zpe.sumelectthermal: -1184.050456 hartree
zpe.sumelectthermalent: -1184.049511 hartree
zpe.sumelectthermalfe: -1184.121935 hartree
dipole: 0.0000 -4.5074 -0.0032
dipole: 4.5074
quadrupole: -109.9053 -147.3047 -152.7656
quadrupole: 0.0000 -0.0744 -0.0020
quadrupole: 26.7532 -10.6462 -16.1070 0.0000 -0.0744 -0.0020
hfenergy: -1184.38694 hartree
pointgroup: C01 [X(C21H16O5)]
dipole: -0.000324 1.773329 0.0102927 debye
polarizability: 668.8375304|-0.0692281|255.9775628|25.1236002|0.7374032|108.7063785 unknown
InChI: InChI=1S/C21H16O5/c22-21-15(7-13-1-5-17-19(9-13)25-11-23-17)3-4-16(21)8-14-2-6-18-20(10-14)26-12-24-18/h1-2,5-10H,3-4,11-12H2
charge 0 multiplicity 1
42 atoms
O  0.000527 -2.930839 -0.015651
O  5.816074 2.429912 0.286254
O  -5.816652 2.431014 -0.262559
O  7.664102 0.894262 0.351571
O  -7.664325 0.895549 -0.340862
C  0.782841 0.676138 0.04286
C  -0.782817 0.676316 -0.037963
C  1.209648 -0.781242 0.049378
C  -1.209205 -0.781055 -0.058738
C  0.000342 -1.657253 -0.009039
C  2.457521 -1.355633 0.098873
C  -2.456955 -1.355247 -0.113367
C  3.788906 -0.755691 0.162989
C  -3.788524 -0.755045 -0.170936
C  4.028217 0.662845 0.189165
C  -4.028249 0.663616 -0.18342
C  5.349758 1.090284 0.251627
C  -5.34996 1.091239 -0.240749
C  4.908154 -1.64588 0.201788
C  -4.907563 -1.645131 -0.217406
C  6.440097 0.192489 0.289841
C  -6.440096 0.193554 -0.286613
C  6.247467 -1.191975 0.265853
C  -6.24705 -1.191024 -0.276074
C  7.297538 2.339402 0.352882
C  -7.298165 2.34075 -0.3279
H  1.126052 1.198672 0.956471
H  1.21848 1.220182 -0.817067
H  -1.126182 1.207659 -0.946427
H  -1.218596 1.211836 0.827223
H  2.43627 -2.457373 0.088712
H  -2.435425 -2.457028 -0.113908
H  3.214631 1.38646 0.161944
H  -3.214833 1.387168 -0.149998
H  4.716661 -2.724202 0.18122
H  -4.715771 -2.723547 -0.207264
H  7.090492 -1.886211 0.29511
H  -7.089902 -1.885192 -0.311331
H  7.646228 2.794145 1.295856
H  7.730286 2.817284 -0.542561
H  -7.64838 2.805008 -1.265638
H  -7.729742 2.809282 0.57305
