program: Gaussian 09
title: 000225923
version: EM64L-G09RevD.01
frameworkgroup: C1[X(C16H15N3O)]
method: RPBEPBE
basis: SDD
operation: Freq
keyword: #p
keyword: freq=noraman
keyword: PBEPBE/SDD
title: #p freq=noraman PBEPBE/SDD
converged: YES YES NO NO
title: Mulliken charges:
elementType: O N N N C C C C C C C C C C C C C C C C H H H H H H H H H H H H H H H
charge: -0.327106 -0.186803 -0.617523 -0.632016 -0.540689 0.355987 0.337014 -0.750316 0.335321 0.349014 -0.435722 -0.425239 -0.431924 -0.431987 0.140348 -0.245876 -0.245184 -0.241593 -0.241812 0.285745 0.245069 0.273958 0.215935 0.240521 0.245985 0.233565 0.234300 0.222038 0.221824 0.222185 0.222615 0.349316 0.313630 0.304458 0.404963
chargesum: 0.00000
title: Mulliken charges with hydrogens summed into heavy atoms:
elementType: O N N N C C C C C C C C C C C C C C C C
charge: -0.327106 -0.186803 0.045424 0.077406 -0.295620 0.355987 0.337014 -0.260423 0.335321 0.349014 -0.195201 -0.179254 -0.198359 -0.197688 0.140348 -0.023838 -0.023360 -0.019408 -0.019197 0.285745
polarizability: 2.20404240e+02 -6.85842908e+00 2.11671296e+02 3.13307074e+01 6.10526298e+00 1.51515381e+02
1716.lowfreq: -13.0975 -6.6611 -0.0008 -0.0002 0.0005 3.1824 12.6170 49.5621 53.9727
frequency: 11.9932 49.4906 53.9641 67.4775 110.1396 131.2483 161.9187 175.6413 209.1762 229.8069 257.2228 301.7562 336.4956 351.1076 355.6362 370.2832 428.1417 440.1344 441.5884 472.0827 504.6056 513.0132 518.8574 534.4802 567.3829 602.2931 614.7220 649.1657 687.4768 712.8863 721.5191 730.1068 738.4987 756.2392 760.5779 803.2225 811.2224 852.9718 869.3514 875.8388 884.2798 887.4412 891.2883 935.7503 944.1283 962.2116 967.8694 981.4731 981.5912 1035.6518 1037.2528 1038.0547 1083.5996 1087.9685 1120.3870 1170.4456 1171.4775 1172.0596 1178.5867 1194.1633 1207.9606 1209.9451 1231.8514 1238.1314 1284.2283 1295.2600 1310.9542 1338.4904 1384.0644 1389.0157 1408.0848 1435.6457 1438.5229 1446.6759 1477.8292 1488.5098 1510.6013 1538.1938 1585.6746 1597.5591 1600.8682 1608.8627 1617.9703 1634.9417 2967.5966 3034.1579 3049.3421 3112.9669 3114.2601 3119.1701 3122.6591 3135.3955 3136.9188 3156.9726 3157.5636 3181.2569 3548.4937 3604.5102 3704.0082
redmass: 5.7754 4.3609 4.3926 4.9120 4.8717 5.0631 4.4814 6.3603 3.5552 4.5634 4.6471 2.7233 1.1012 5.2611 5.3331 4.7320 3.9700 3.0695 3.1479 3.1800 1.5367 3.3423 3.4114 3.2987 1.1731 6.4254 5.0166 5.4132 6.5280 4.5291 5.6908 2.0173 2.9396 1.3918 2.1605 3.6982 3.8387 1.8013 1.4597 3.1534 2.1406 1.7337 2.7561 1.8745 1.4208 1.9437 3.3942 1.3176 1.3259 2.2674 1.7472 1.9679 2.2680 1.7906 1.8190 1.0783 1.9271 1.3284 1.1649 2.1683 1.4475 1.8057 1.9094 1.3215 1.4299 3.0176 4.9315 1.3940 9.8264 5.1019 2.2682 1.5656 1.4868 2.5027 2.4690 2.5816 3.2212 3.1696 6.3320 1.9663 4.2013 6.4974 6.7172 1.5800 1.0627 1.0963 1.0848 1.0856 1.0857 1.0890 1.0886 1.0936 1.0941 1.1006 1.1006 1.0669 1.0453 1.0874 1.1052
irintensity: 3.2269 0.2768 0.7957 2.4929 1.7510 0.3547 2.2363 12.3629 3.9493 3.9386 5.2832 3.0775 19.5189 1.9924 9.3723 0.1130 7.5981 5.9776 5.3098 6.5072 284.4972 41.0879 5.4526 51.9378 9.6403 0.6846 8.2639 18.7738 10.8016 4.3047 0.7157 117.1813 5.3990 11.1638 36.0791 1.2593 1.6750 2.7730 0.4338 13.4855 50.1560 75.5980 25.8208 0.7759 0.6961 6.6181 44.8940 0.0166 0.0439 2.5654 16.8532 15.5125 0.1186 2.6134 17.2205 0.0927 10.1197 2.0734 0.2322 0.1331 2.3482 14.2673 17.2897 1.9946 0.3039 46.4303 342.5777 3.7166 3.2572 1.7342 248.5908 9.7653 18.9809 0.4174 53.5178 11.9513 217.7975 178.8909 5.2434 247.0260 59.8149 0.7741 1.7607 733.5771 10.7572 25.5575 5.9747 6.3173 7.2714 3.1825 3.9119 27.2831 39.0891 68.6318 14.7878 234.3992 73.4297 38.8622 38.0821
temp: 298.150 k
press: 1.00000 atm
elementType: 8 7 7 7 6 6 6 6 6 6 6 6 6 6 6 6 6 6 6 6 1 1 1 1 1 1 1 1 1 1 1 1 1 1 1
symmnumber: 1
zpe: 729306.5 jmol-1
zpe.correction: 0.277778 hartree
zpe.thermalcorrener: 0.294456 hartree
zpe.thermalcorrenthalpy: 0.295400 hartree
zpe.thermalcorrgfe: 0.232176 hartree
zpe.sumelectzpe: -856.823755 hartree
zpe.sumelectthermal: -856.807077 hartree
zpe.sumelectthermalent: -856.806132 hartree
zpe.sumelectthermalfe: -856.869357 hartree
dipole: -5.7866 -0.7161 0.2958
dipole: 5.8382
quadrupole: -74.4615 -112.2700 -111.5149
quadrupole: 6.2717 3.3784 1.1253
quadrupole: 24.9540 -12.8546 -12.0994 6.2717 3.3784 1.1253
hfenergy: -857.1015327 hartree
pointgroup: C01 [X(C16H15N3O1)]
dipole: 2.0354239 -0.9901933 0.390532 debye
polarizability: 217.0060661|-9.286533|221.642311|-22.1387595|6.8378711|144.9425405 unknown
InChI: InChI=1S/C16H15N3O/c17-16(18)19-15(20)14-12-7-3-1-5-10(12)9-11-6-2-4-8-13(11)14/h1-8,14H,9,17-18H2
charge 0 multiplicity 1
35 atoms
O  1.227651 0.013942 1.537076
N  2.51249 -0.930623 -0.240328
N  4.586636 -1.947802 -0.028651
N  3.557256 -1.091556 1.928322
C  0.318862 0.044818 -0.758539
C  -0.124027 1.501366 -0.652406
C  -0.856562 -0.918738 -0.570744
C  -1.873422 0.768065 1.035618
C  -1.1895 1.853688 0.217204
C  -1.921357 -0.564379 0.300884
C  0.524328 2.504464 -1.410619
C  -0.882571 -2.161958 -1.245566
C  -1.588568 3.208096 0.307595
C  -3.001089 -1.463379 0.470197
C  1.406108 -0.287357 0.292678
C  0.128877 3.856603 -1.307673
C  -1.958252 -3.058826 -1.062406
C  -0.933301 4.209691 -0.443613
C  -3.023041 -2.70693 -0.200664
C  3.52928 -1.308425 0.577822
H  0.787589 -0.137933 -1.740131
H  -1.28835 0.627516 1.967786
H  -2.890228 1.08521 1.332241
H  1.343948 2.223442 -2.083377
H  -0.052955 -2.425783 -1.91213
H  -2.418509 3.480161 0.971504
H  -3.830661 -1.186402 1.132525
H  0.638595 4.625691 -1.898974
H  -1.97002 -4.019044 -1.590385
H  -1.253093 5.254829 -0.361769
H  -3.866156 -3.392481 -0.057688
H  4.5150 -2.086038 -1.034175
H  5.403438 -2.278321 0.478175
H  4.330449 -1.381039 2.524566
H  2.709756 -0.601965 2.286747
