program: Gaussian 09
title: 000225879
version: EM64L-G09RevD.01
frameworkgroup: C1[X(C15H20O4)]
method: RPBEPBE
basis: SDD
operation: Freq
keyword: #pfreq=noraman
keyword: PBEPBE/SDD
title: #p freq=noraman PBEPBE/SDD
converged: YES YES NO NO
title: Mulliken charges:
elementType: O O O O C C C C C C C C C C C C C C C H H H H H H H H H H H H H H H H H H H H
charge: -0.268584 -0.268201 -0.260037 -0.257201 -0.491076 -0.225591 -0.351059 -0.357064 0.598734 -0.352674 -0.509700 -0.429235 0.194377 0.158546 -0.334154 -0.695136 -0.204770 0.300809 -0.755662 0.218393 0.217462 0.269828 0.215280 0.188912 0.197631 0.189835 0.198889 0.191344 0.258710 0.258785 0.252287 0.209665 0.215937 0.210906 0.233024 0.241296 0.243642 0.249003 0.246852
chargesum: 0.00000
title: Mulliken charges with hydrogens summed into heavy atoms:
elementType: O O O O C C C C C C C C C C C C C C C
charge: -0.268584 -0.268201 -0.260037 -0.257201 -0.055220 0.044236 0.053133 0.030402 0.598734 0.037558 -0.250991 -0.170450 0.194377 0.158546 -0.081867 -0.058628 0.269550 0.300809 -0.016165
polarizability: 1.96800366e+02 -2.33368438e+01 1.66588395e+02 -4.50913890e+00 -1.06334941e+00 1.58047563e+02
1716.lowfreq: -13.5631 -10.1130 -6.7252 -0.0001 0.0006 0.0008 12.7684 14.9095 31.4219
frequency: 6.4151 13.9177 31.1222 35.9051 54.2128 57.5746 64.5950 78.1761 90.8013 118.0558 128.0682 172.3841 193.9957 215.0484 225.2916 228.0732 262.2387 272.8731 335.2173 378.4057 391.7116 406.8568 433.3988 460.9003 516.3873 535.5288 567.6849 580.5108 606.8975 647.3338 676.4654 716.0208 724.8433 735.9132 770.7933 781.4546 807.6686 835.5557 837.6210 853.4257 876.9260 883.5848 900.6765 916.2933 931.2759 938.4588 970.2961 982.0828 993.2499 1041.7720 1043.6539 1055.0020 1070.1808 1076.3897 1086.5234 1111.0363 1114.2875 1127.0605 1143.9853 1187.2160 1195.1341 1202.2554 1224.4728 1248.5933 1260.7243 1268.9723 1278.5438 1287.3949 1301.6297 1330.8252 1345.2344 1347.5536 1358.4321 1364.7111 1382.7233 1386.5504 1418.8800 1442.3170 1453.4439 1456.0159 1463.3780 1466.7816 1474.4986 1475.5367 1476.6644 1477.5957 1485.4817 1486.5263 1610.5850 1628.2535 1640.2710 2955.2242 2965.5435 2972.0130 2974.3245 2989.7160 2995.7989 2999.0428 3005.3095 3017.7314 3032.3595 3043.5774 3056.9319 3068.7153 3071.4931 3098.7853 3107.7884 3139.6015 3151.4783 3171.4184 3183.0147
redmass: 3.7549 4.5931 1.8718 4.6339 2.5806 1.6685 2.0682 2.4882 2.9930 3.3010 3.8020 3.4018 5.1049 2.4961 1.5654 3.2013 3.9953 4.1542 5.1041 3.6845 2.8484 3.2108 3.4979 4.0538 3.2378 3.8483 3.9276 4.5795 5.4813 4.5806 8.8824 2.4540 1.7384 1.9474 1.8267 3.4037 1.7450 4.2186 2.2718 2.2516 3.1990 1.6606 2.9297 1.8558 2.5843 1.4347 2.9146 2.0611 1.8421 1.7401 2.3526 2.9212 1.5003 2.4227 2.1201 1.8052 1.9188 1.0670 1.7047 1.7676 1.7160 2.7209 1.4265 3.4325 1.3310 1.3209 1.2856 1.1101 1.1190 1.5382 1.6130 1.6224 1.5529 1.3099 1.2438 1.2164 2.4699 4.0029 1.0597 1.0536 1.0684 1.0742 1.2465 1.0610 1.4588 1.0802 1.5346 1.0877 7.7542 8.3290 9.5536 1.0588 1.0595 1.0361 1.0601 1.0646 1.0944 1.0607 1.0380 1.1010 1.0979 1.0983 1.0943 1.1007 1.0993 1.0945 1.1105 1.1023 1.0901 1.0926 1.0960
irintensity: 0.0134 0.0601 0.1039 0.5518 1.3558 1.5959 1.9714 13.6837 1.3434 2.2473 0.7926 0.2087 3.6218 1.4205 1.2177 2.0970 1.4137 5.0159 0.6370 4.9989 1.9046 0.5682 8.3859 8.0215 2.6289 10.9159 6.9496 3.7372 5.7879 9.3641 0.4393 12.0026 3.0534 10.8753 14.4812 4.3794 55.3606 28.0995 15.8835 5.2272 61.4128 21.5255 59.2036 34.2027 18.5429 8.5262 84.7724 61.7609 58.0671 6.4282 4.4600 15.5916 7.1984 2.7918 1.9577 4.3126 11.5987 0.7666 8.1352 9.0423 61.3675 324.6850 11.3829 181.4975 10.4491 13.6793 9.3937 5.2602 5.9222 1.7939 12.5682 34.1725 1.3303 5.8582 54.2753 11.4905 1.6971 76.5217 21.9213 21.3175 2.5041 1.6073 28.2723 5.5911 46.8777 1.7864 51.8243 15.1679 6.2196 4.0873 148.0504 5.0538 19.9105 37.0227 73.7785 22.9944 3.0762 128.8703 3.2449 1.7663 26.8097 58.8659 48.1781 90.8131 54.3475 10.3229 30.2861 9.7103 3.3724 2.0755 2.9498
temp: 298.150 k
press: 1.00000 atm
elementType: 8 8 8 8 6 6 6 6 6 6 6 6 6 6 6 6 6 6 6 1 1 1 1 1 1 1 1 1 1 1 1 1 1 1 1 1 1 1 1
symmnumber: 1
zpe: 840610.7 jmol-1
zpe.correction: 0.320172 hartree
zpe.thermalcorrener: 0.340401 hartree
zpe.thermalcorrenthalpy: 0.341345 hartree
zpe.thermalcorrgfe: 0.265840 hartree
zpe.sumelectzpe: -883.028661 hartree
zpe.sumelectthermal: -883.008433 hartree
zpe.sumelectthermalent: -883.007488 hartree
zpe.sumelectthermalfe: -883.082994 hartree
dipole: 0.7331 -0.4042 -1.7241
dipole: 1.9166
quadrupole: -102.3382 -109.2923 -117.7845
quadrupole: 0.0049 0.8837 -4.6368
quadrupole: 7.4668 0.5127 -7.9795 0.0049 0.8837 -4.6368
hfenergy: -883.3488332 hartree
pointgroup: C01 [X(C15H20O4)]
dipole: 0.2431782 -0.1666823 -0.6940263 debye
polarizability: 188.4116031|-26.5959584|174.6637451|-6.7544098|1.1754556|158.3609749 unknown
InChI: InChI=1S/C15H20O4/c1-3-4-5-6-13(19-11(2)16)12-7-8-14-15(9-12)18-10-17-14/h7-9,13H,3-6,10H2,1-2H3
charge 0 multiplicity 1
39 atoms
O  -0.353529 2.509237 -0.570624
O  3.027113 -1.783742 -1.565649
O  3.474398 -2.417664 0.704458
O  -0.389778 3.077585 1.697484
C  -1.802444 0.781983 -1.443047
C  -0.913771 1.134504 -0.239307
C  -2.512621 -0.588137 -1.318846
C  -3.491128 -0.696672 -0.125548
C  0.242095 0.186748 0.041328
C  -4.294394 -2.017242 -0.130973
C  1.05503 -0.305001 -1.025106
C  0.519496 -0.190024 1.379231
C  2.109957 -1.149005 -0.686063
C  2.374906 -1.524244 0.649779
C  1.593012 -1.061672 1.709514
C  -5.274141 -2.131091 1.056985
C  4.024555 -2.436388 -0.678125
C  -0.111619 3.364259 0.50957
C  0.539618 4.646003 0.034089
H  -1.190422 0.802361 -2.365102
H  -2.557849 1.584387 -1.550248
H  -1.515359 1.255191 0.67864
H  -1.757492 -1.395984 -1.247659
H  -3.075528 -0.768408 -2.257072
H  -2.935177 -0.621913 0.83135
H  -4.196128 0.16099 -0.147561
H  -3.588099 -2.87218 -0.114011
H  -4.856083 -2.096924 -1.084361
H  0.86926 -0.024874 -2.065124
H  -0.097477 0.224844 2.182852
H  1.802047 -1.351723 2.74198
H  -6.008819 -1.303848 1.044779
H  -5.836023 -3.082785 1.029407
H  -4.734719 -2.085052 2.021897
H  4.96376 -1.851761 -0.698376
H  4.159184 -3.48162 -0.995919
H  0.382105 5.440991 0.778169
H  1.626838 4.480798 -0.079251
H  0.142124 4.949074 -0.947339
