program: Gaussian 09
title: 000225873
version: EM64L-G09RevD.01
frameworkgroup: C1[X(C14H18O4)]
method: RPBEPBE
basis: SDD
operation: Freq
keyword: #pfreq=noraman
keyword: PBEPBE/SDD
title: #p freq=noraman PBEPBE/SDD
converged: YES YES NO NO
title: Mulliken charges:
elementType: O O O O C C C C C C C C C C C C C C H H H H H H H H H H H H H H H H H H
charge: -0.255273 -0.249228 -0.270892 -0.265606 -0.058759 -0.360401 -0.373387 -0.612869 0.329636 0.564665 -0.700586 -0.713406 -0.546594 -0.390305 0.199243 0.162015 -0.336104 -0.202023 0.254752 0.250134 0.170342 0.177107 0.229887 0.211646 0.214037 0.233376 0.214129 0.232257 0.214207 0.246383 0.215125 0.256859 0.236215 0.249851 0.236722 0.236847
chargesum: 0.00000
title: Mulliken charges with hydrogens summed into heavy atoms:
elementType: O O O O C C C C C C C C C C C C C C
charge: -0.255273 -0.249228 -0.270892 -0.265606 0.195993 0.060075 0.033607 -0.187187 0.329636 0.564665 -0.020824 -0.037692 -0.289735 -0.154089 0.199243 0.162015 -0.086253 0.271545
polarizability: 2.15951199e+02 1.74960433e+01 1.41458936e+02 -1.12101568e+01 1.02805561e+01 1.27548497e+02
1716.lowfreq: -56.0624 -0.0009 -0.0008 -0.0006 2.8035 7.4708 14.2148 25.8429 32.7353
frequency: -56.0007 25.0317 32.7030 43.5805 93.7075 141.0878 141.8762 187.9635 209.2764 222.5805 241.9408 247.7020 288.0628 302.4096 308.1550 343.4263 400.7158 408.5446 419.4910 427.1131 470.3359 472.4811 486.9094 516.8307 586.4026 618.4377 653.2479 678.7494 687.1664 720.4842 742.8166 753.7902 777.3966 814.3970 839.6470 841.7748 877.8042 898.5797 904.0791 914.9496 922.7302 932.5937 935.8433 963.9696 977.9313 994.1315 1015.6555 1052.8379 1062.0429 1065.0227 1108.5220 1119.0894 1119.5097 1134.4285 1146.2328 1175.7262 1186.8527 1189.0466 1203.9913 1253.2009 1255.1966 1264.3753 1274.7125 1281.9583 1310.2479 1337.2680 1354.2650 1365.2539 1369.1713 1377.0683 1391.4393 1398.1962 1439.7964 1450.0178 1455.8741 1464.7808 1465.8472 1471.7995 1477.8030 1485.1640 1487.5181 1487.9251 1610.5911 1629.6185 2933.3767 2942.0100 2968.4868 2999.1028 3006.2321 3010.2702 3010.8484 3027.4218 3064.2426 3084.4593 3088.2291 3094.6956 3102.1547 3115.2807 3122.4462 3135.8957 3161.7515 3179.8370
redmass: 2.3406 4.8817 4.2590 4.6419 3.9044 1.2619 3.2539 1.6527 2.0831 5.7896 1.8388 3.9600 3.1470 3.1528 3.5825 3.1348 2.7105 2.7497 3.4235 2.1722 3.8545 4.5540 3.8710 5.3357 5.0837 5.5535 3.5478 9.5270 4.8985 4.1771 3.8637 3.9275 5.9775 1.4287 3.0630 3.3994 1.5474 2.5578 1.8869 2.1801 1.4939 1.3635 1.9020 7.1202 5.5048 1.3448 5.5518 2.4983 3.5915 1.4647 2.1153 2.4604 1.0638 1.4484 1.9068 1.3468 1.6212 2.3856 1.1857 1.9958 3.3949 1.2144 1.4442 1.7945 1.4231 1.2922 1.4243 1.2781 1.3461 1.2857 1.2464 3.9393 4.3351 1.0567 1.0578 1.0610 1.0772 1.1124 1.9697 1.0692 1.1466 1.2797 7.8004 8.2622 1.0688 1.0674 1.0597 1.0359 1.0862 1.0355 1.0531 1.0973 1.0957 1.0943 1.1190 1.0989 1.1005 1.1002 1.1004 1.0897 1.0928 1.0955
irintensity: 14.6688 0.1991 0.2389 0.2864 0.4400 0.1432 0.0230 0.4393 0.5529 0.1143 0.1549 9.5263 1.0711 0.1710 8.2553 1.4305 0.5041 1.9937 4.8556 7.0971 1.9860 2.8618 14.1723 4.5895 2.2537 0.7770 20.8765 0.6488 7.9625 4.5919 33.7418 12.4663 10.9693 39.1136 25.1493 8.8703 20.9568 2.7224 9.1337 11.1357 1.6498 1.6875 13.5349 29.2581 134.5192 1.8803 143.9212 8.8220 7.3102 4.3418 20.6255 23.3718 1.0080 3.4780 58.0803 17.4504 70.1834 109.9650 8.6374 111.0562 115.7017 3.8618 5.9087 5.0954 3.1729 0.5782 3.4661 0.3150 21.2964 28.4926 38.5454 8.7867 42.7453 4.8752 0.6160 8.9550 2.1126 10.5696 121.8871 9.6616 5.6554 46.8839 7.5673 0.8987 33.7490 61.5262 41.7373 14.9347 11.3750 20.6095 121.2072 30.2120 37.4206 29.2594 33.9451 32.5966 5.9269 27.9408 21.3014 11.0804 4.3001 4.0502
temp: 298.150 k
press: 1.00000 atm
elementType: 8 8 8 8 6 6 6 6 6 6 6 6 6 6 6 6 6 6 1 1 1 1 1 1 1 1 1 1 1 1 1 1 1 1 1 1
symmnumber: 1
zpe: 773108.4 jmol-1
zpe.correction: 0.294461 hartree
zpe.thermalcorrener: 0.310621 hartree
zpe.thermalcorrenthalpy: 0.311565 hartree
zpe.thermalcorrgfe: 0.249871 hartree
zpe.sumelectzpe: -843.776486 hartree
zpe.sumelectthermal: -843.760326 hartree
zpe.sumelectthermalent: -843.759382 hartree
zpe.sumelectthermalfe: -843.821076 hartree
dipole: -1.1099 -0.2291 -1.8301
dipole: 2.1526
quadrupole: -103.1392 -104.4932 -107.8332
quadrupole: 1.1268 -5.6155 1.0428
quadrupole: 2.0160 0.6620 -2.6780 1.1268 -5.6155 1.0428
hfenergy: -844.070947 hartree
pointgroup: C01 [X(C14H18O4)]
dipole: -0.4233398 -0.0218517 -0.7331568 debye
polarizability: 215.1325497|20.6023715|140.1389394|-8.012965|11.6637482|129.6871426 unknown
InChI: InChI=1S/C14H18O4/c1-14(2)17-7-11(8-18-14)5-10-3-4-12-13(6-10)16-9-15-12/h3-4,6,11H,5,7-9H2,1-2H3
charge 0 multiplicity 1
36 atoms
O  2.848703 -1.040401 0.823516
O  4.016856 0.993022 0.176694
O  -3.871183 -1.533081 -1.019412
O  -4.773622 -0.364087 0.879282
C  1.550796 0.847845 -0.142173
C  1.685941 -0.683406 -0.011581
C  2.887457 1.406551 -0.674651
C  0.373203 1.25546 -1.070358
C  4.12843 -0.473619 0.347819
C  -0.996461 0.861594 -0.528498
C  4.590412 -1.153587 -0.959483
C  5.110326 -0.670549 1.499901
C  -1.731402 -0.200937 -1.134169
C  -1.542045 1.54368 0.590458
C  -2.973059 -0.526078 -0.583416
C  -3.501711 0.158426 0.529406
C  -2.807484 1.204327 1.141762
C  -5.031924 -1.462818 -0.089852
H  1.385097 1.26196 0.871186
H  0.822295 -1.127832 0.507628
H  1.766504 -1.146797 -1.020958
H  3.045703 1.082058 -1.727644
H  2.907121 2.509406 -0.64474
H  0.527884 0.800842 -2.069326
H  0.415155 2.354148 -1.215436
H  4.704481 -2.237594 -0.788049
H  3.878718 -1.012483 -1.790703
H  5.564093 -0.7358 -1.267715
H  6.092139 -0.241262 1.23971
H  4.721879 -0.161843 2.396289
H  5.227003 -1.744928 1.719001
H  -1.340232 -0.741012 -2.001329
H  -0.973661 2.364017 1.043736
H  -3.222159 1.736867 2.001282
H  -5.109309 -2.41704 0.459883
H  -5.940847 -1.22525 -0.668966
